Build failed in Jenkins: commons-rdf #167

classic Classic list List threaded Threaded
2 messages Options
Reply | Threaded
Open this post in threaded view
|

Build failed in Jenkins: commons-rdf #167

Apache Jenkins Server
See <https://builds.apache.org/job/commons-rdf/167/display/redirect>

------------------------------------------
Started by an SCM change
[EnvInject] - Loading node environment variables.
Building remotely on H9 (Hadoop) in workspace <https://builds.apache.org/job/commons-rdf/ws/>
Cloning the remote Git repository
Cloning repository https://git-wip-us.apache.org/repos/asf/incubator-commonsrdf.git
 > git init <https://builds.apache.org/job/commons-rdf/ws/> # timeout=10
Fetching upstream changes from https://git-wip-us.apache.org/repos/asf/incubator-commonsrdf.git
 > git --version # timeout=10
 > git fetch --tags --progress https://git-wip-us.apache.org/repos/asf/incubator-commonsrdf.git +refs/heads/*:refs/remotes/origin/*
ERROR: Error cloning remote repo 'origin'
hudson.plugins.git.GitException: Command "git fetch --tags --progress https://git-wip-us.apache.org/repos/asf/incubator-commonsrdf.git +refs/heads/*:refs/remotes/origin/*" returned status code 128:
stdout:
stderr: fatal: repository 'https://git-wip-us.apache.org/repos/asf/incubator-commonsrdf.git/' not found

        at org.jenkinsci.plugins.gitclient.CliGitAPIImpl.launchCommandIn(CliGitAPIImpl.java:1903)
        at org.jenkinsci.plugins.gitclient.CliGitAPIImpl.launchCommandWithCredentials(CliGitAPIImpl.java:1622)
        at org.jenkinsci.plugins.gitclient.CliGitAPIImpl.access$300(CliGitAPIImpl.java:71)
        at org.jenkinsci.plugins.gitclient.CliGitAPIImpl$1.execute(CliGitAPIImpl.java:348)
        at org.jenkinsci.plugins.gitclient.CliGitAPIImpl$2.execute(CliGitAPIImpl.java:545)
        at org.jenkinsci.plugins.gitclient.RemoteGitImpl$CommandInvocationHandler$1.call(RemoteGitImpl.java:153)
        at org.jenkinsci.plugins.gitclient.RemoteGitImpl$CommandInvocationHandler$1.call(RemoteGitImpl.java:146)
        at hudson.remoting.UserRequest.perform(UserRequest.java:153)
        at hudson.remoting.UserRequest.perform(UserRequest.java:50)
        at hudson.remoting.Request$2.run(Request.java:336)
        at hudson.remoting.InterceptingExecutorService$1.call(InterceptingExecutorService.java:68)
        at java.util.concurrent.FutureTask.run(FutureTask.java:262)
        at java.util.concurrent.ThreadPoolExecutor.runWorker(ThreadPoolExecutor.java:1145)
        at java.util.concurrent.ThreadPoolExecutor$Worker.run(ThreadPoolExecutor.java:615)
        at java.lang.Thread.run(Thread.java:745)
        at ......remote call to H9(Native Method)
        at hudson.remoting.Channel.attachCallSiteStackTrace(Channel.java:1545)
        at hudson.remoting.UserResponse.retrieve(UserRequest.java:253)
        at hudson.remoting.Channel.call(Channel.java:830)
        at org.jenkinsci.plugins.gitclient.RemoteGitImpl$CommandInvocationHandler.execute(RemoteGitImpl.java:146)
        at sun.reflect.GeneratedMethodAccessor834.invoke(Unknown Source)
        at sun.reflect.DelegatingMethodAccessorImpl.invoke(DelegatingMethodAccessorImpl.java:43)
        at java.lang.reflect.Method.invoke(Method.java:498)
        at org.jenkinsci.plugins.gitclient.RemoteGitImpl$CommandInvocationHandler.invoke(RemoteGitImpl.java:132)
        at com.sun.proxy.$Proxy126.execute(Unknown Source)
        at hudson.plugins.git.GitSCM.retrieveChanges(GitSCM.java:1067)
        at hudson.plugins.git.GitSCM.checkout(GitSCM.java:1107)
        at hudson.scm.SCM.checkout(SCM.java:496)
        at hudson.model.AbstractProject.checkout(AbstractProject.java:1281)
        at hudson.model.AbstractBuild$AbstractBuildExecution.defaultCheckout(AbstractBuild.java:604)
        at jenkins.scm.SCMCheckoutStrategy.checkout(SCMCheckoutStrategy.java:86)
        at hudson.model.AbstractBuild$AbstractBuildExecution.run(AbstractBuild.java:529)
        at hudson.model.Run.execute(Run.java:1728)
        at hudson.maven.MavenModuleSetBuild.run(MavenModuleSetBuild.java:542)
        at hudson.model.ResourceController.execute(ResourceController.java:98)
        at hudson.model.Executor.run(Executor.java:405)
ERROR: null
Retrying after 10 seconds
 > git rev-parse --is-inside-work-tree # timeout=10
Fetching changes from the remote Git repository
 > git config remote.origin.url https://git-wip-us.apache.org/repos/asf/incubator-commonsrdf.git # timeout=10
Fetching upstream changes from https://git-wip-us.apache.org/repos/asf/incubator-commonsrdf.git
 > git --version # timeout=10
 > git fetch --tags --progress https://git-wip-us.apache.org/repos/asf/incubator-commonsrdf.git +refs/heads/*:refs/remotes/origin/*
ERROR: Error fetching remote repo 'origin'
hudson.plugins.git.GitException: Failed to fetch from https://git-wip-us.apache.org/repos/asf/incubator-commonsrdf.git
        at hudson.plugins.git.GitSCM.fetchFrom(GitSCM.java:809)
        at hudson.plugins.git.GitSCM.retrieveChanges(GitSCM.java:1076)
        at hudson.plugins.git.GitSCM.checkout(GitSCM.java:1107)
        at hudson.scm.SCM.checkout(SCM.java:496)
        at hudson.model.AbstractProject.checkout(AbstractProject.java:1281)
        at hudson.model.AbstractBuild$AbstractBuildExecution.defaultCheckout(AbstractBuild.java:604)
        at jenkins.scm.SCMCheckoutStrategy.checkout(SCMCheckoutStrategy.java:86)
        at hudson.model.AbstractBuild$AbstractBuildExecution.run(AbstractBuild.java:529)
        at hudson.model.Run.execute(Run.java:1728)
        at hudson.maven.MavenModuleSetBuild.run(MavenModuleSetBuild.java:542)
        at hudson.model.ResourceController.execute(ResourceController.java:98)
        at hudson.model.Executor.run(Executor.java:405)
Caused by: hudson.plugins.git.GitException: Command "git fetch --tags --progress https://git-wip-us.apache.org/repos/asf/incubator-commonsrdf.git +refs/heads/*:refs/remotes/origin/*" returned status code 128:
stdout:
stderr: fatal: repository 'https://git-wip-us.apache.org/repos/asf/incubator-commonsrdf.git/' not found

        at org.jenkinsci.plugins.gitclient.CliGitAPIImpl.launchCommandIn(CliGitAPIImpl.java:1903)
        at org.jenkinsci.plugins.gitclient.CliGitAPIImpl.launchCommandWithCredentials(CliGitAPIImpl.java:1622)
        at org.jenkinsci.plugins.gitclient.CliGitAPIImpl.access$300(CliGitAPIImpl.java:71)
        at org.jenkinsci.plugins.gitclient.CliGitAPIImpl$1.execute(CliGitAPIImpl.java:348)
        at org.jenkinsci.plugins.gitclient.RemoteGitImpl$CommandInvocationHandler$1.call(RemoteGitImpl.java:153)
        at org.jenkinsci.plugins.gitclient.RemoteGitImpl$CommandInvocationHandler$1.call(RemoteGitImpl.java:146)
        at hudson.remoting.UserRequest.perform(UserRequest.java:153)
        at hudson.remoting.UserRequest.perform(UserRequest.java:50)
        at hudson.remoting.Request$2.run(Request.java:336)
        at hudson.remoting.InterceptingExecutorService$1.call(InterceptingExecutorService.java:68)
        at java.util.concurrent.FutureTask.run(FutureTask.java:262)
        at java.util.concurrent.ThreadPoolExecutor.runWorker(ThreadPoolExecutor.java:1145)
        at java.util.concurrent.ThreadPoolExecutor$Worker.run(ThreadPoolExecutor.java:615)
        at java.lang.Thread.run(Thread.java:745)
        at ......remote call to H9(Native Method)
        at hudson.remoting.Channel.attachCallSiteStackTrace(Channel.java:1545)
        at hudson.remoting.UserResponse.retrieve(UserRequest.java:253)
        at hudson.remoting.Channel.call(Channel.java:830)
        at org.jenkinsci.plugins.gitclient.RemoteGitImpl$CommandInvocationHandler.execute(RemoteGitImpl.java:146)
        at sun.reflect.GeneratedMethodAccessor834.invoke(Unknown Source)
        at sun.reflect.DelegatingMethodAccessorImpl.invoke(DelegatingMethodAccessorImpl.java:43)
        at java.lang.reflect.Method.invoke(Method.java:498)
        at org.jenkinsci.plugins.gitclient.RemoteGitImpl$CommandInvocationHandler.invoke(RemoteGitImpl.java:132)
        at com.sun.proxy.$Proxy104.execute(Unknown Source)
        at hudson.plugins.git.GitSCM.fetchFrom(GitSCM.java:807)
        ... 11 more
ERROR: null
Retrying after 10 seconds
 > git rev-parse --is-inside-work-tree # timeout=10
Fetching changes from the remote Git repository
 > git config remote.origin.url https://git-wip-us.apache.org/repos/asf/incubator-commonsrdf.git # timeout=10
Fetching upstream changes from https://git-wip-us.apache.org/repos/asf/incubator-commonsrdf.git
 > git --version # timeout=10
 > git fetch --tags --progress https://git-wip-us.apache.org/repos/asf/incubator-commonsrdf.git +refs/heads/*:refs/remotes/origin/*
ERROR: Error fetching remote repo 'origin'
hudson.plugins.git.GitException: Failed to fetch from https://git-wip-us.apache.org/repos/asf/incubator-commonsrdf.git
        at hudson.plugins.git.GitSCM.fetchFrom(GitSCM.java:809)
        at hudson.plugins.git.GitSCM.retrieveChanges(GitSCM.java:1076)
        at hudson.plugins.git.GitSCM.checkout(GitSCM.java:1107)
        at hudson.scm.SCM.checkout(SCM.java:496)
        at hudson.model.AbstractProject.checkout(AbstractProject.java:1281)
        at hudson.model.AbstractBuild$AbstractBuildExecution.defaultCheckout(AbstractBuild.java:604)
        at jenkins.scm.SCMCheckoutStrategy.checkout(SCMCheckoutStrategy.java:86)
        at hudson.model.AbstractBuild$AbstractBuildExecution.run(AbstractBuild.java:529)
        at hudson.model.Run.execute(Run.java:1728)
        at hudson.maven.MavenModuleSetBuild.run(MavenModuleSetBuild.java:542)
        at hudson.model.ResourceController.execute(ResourceController.java:98)
        at hudson.model.Executor.run(Executor.java:405)
Caused by: hudson.plugins.git.GitException: Command "git fetch --tags --progress https://git-wip-us.apache.org/repos/asf/incubator-commonsrdf.git +refs/heads/*:refs/remotes/origin/*" returned status code 128:
stdout:
stderr: fatal: repository 'https://git-wip-us.apache.org/repos/asf/incubator-commonsrdf.git/' not found

        at org.jenkinsci.plugins.gitclient.CliGitAPIImpl.launchCommandIn(CliGitAPIImpl.java:1903)
        at org.jenkinsci.plugins.gitclient.CliGitAPIImpl.launchCommandWithCredentials(CliGitAPIImpl.java:1622)
        at org.jenkinsci.plugins.gitclient.CliGitAPIImpl.access$300(CliGitAPIImpl.java:71)
        at org.jenkinsci.plugins.gitclient.CliGitAPIImpl$1.execute(CliGitAPIImpl.java:348)
        at org.jenkinsci.plugins.gitclient.RemoteGitImpl$CommandInvocationHandler$1.call(RemoteGitImpl.java:153)
        at org.jenkinsci.plugins.gitclient.RemoteGitImpl$CommandInvocationHandler$1.call(RemoteGitImpl.java:146)
        at hudson.remoting.UserRequest.perform(UserRequest.java:153)
        at hudson.remoting.UserRequest.perform(UserRequest.java:50)
        at hudson.remoting.Request$2.run(Request.java:336)
        at hudson.remoting.InterceptingExecutorService$1.call(InterceptingExecutorService.java:68)
        at java.util.concurrent.FutureTask.run(FutureTask.java:262)
        at java.util.concurrent.ThreadPoolExecutor.runWorker(ThreadPoolExecutor.java:1145)
        at java.util.concurrent.ThreadPoolExecutor$Worker.run(ThreadPoolExecutor.java:615)
        at java.lang.Thread.run(Thread.java:745)
        at ......remote call to H9(Native Method)
        at hudson.remoting.Channel.attachCallSiteStackTrace(Channel.java:1545)
        at hudson.remoting.UserResponse.retrieve(UserRequest.java:253)
        at hudson.remoting.Channel.call(Channel.java:830)
        at org.jenkinsci.plugins.gitclient.RemoteGitImpl$CommandInvocationHandler.execute(RemoteGitImpl.java:146)
        at sun.reflect.GeneratedMethodAccessor834.invoke(Unknown Source)
        at sun.reflect.DelegatingMethodAccessorImpl.invoke(DelegatingMethodAccessorImpl.java:43)
        at java.lang.reflect.Method.invoke(Method.java:498)
        at org.jenkinsci.plugins.gitclient.RemoteGitImpl$CommandInvocationHandler.invoke(RemoteGitImpl.java:132)
        at com.sun.proxy.$Proxy104.execute(Unknown Source)
        at hudson.plugins.git.GitSCM.fetchFrom(GitSCM.java:807)
        ... 11 more
ERROR: null


---------------------------------------------------------------------
To unsubscribe, e-mail: [hidden email]
For additional commands, e-mail: [hidden email]

Reply | Threaded
Open this post in threaded view
|

Build failed in Jenkins: commons-rdf #168

Apache Jenkins Server
See <https://builds.apache.org/job/commons-rdf/168/display/redirect>

------------------------------------------
[...truncated 243.18 KB...]
[INFO] Building jar: <https://builds.apache.org/job/commons-rdf/ws/api/target/commons-rdf-api-0.4.0-SNAPSHOT-javadoc.jar>
[INFO]
[INFO] --- maven-site-plugin:3.6:attach-descriptor (attach-descriptor) @ commons-rdf-api ---
[INFO] Skipping because packaging 'jar' is not pom.
[INFO]
[INFO] >>> maven-source-plugin:3.0.1:jar (default) @ commons-rdf-api >>>
[INFO]
[INFO] --- maven-enforcer-plugin:1.4.1:enforce (enforce-maven-3) @ commons-rdf-api ---
[INFO]
[INFO] --- build-helper-maven-plugin:1.10:parse-version (parse-version) @ commons-rdf-api ---
[INFO]
[INFO] --- maven-antrun-plugin:1.8:run (javadoc.resources) @ commons-rdf-api ---
[INFO] Executing tasks

main:
[INFO] Executed tasks
[WARNING] Failed to getClass for org.apache.maven.plugins.source.SourceJarMojo
[INFO]
[INFO] <<< maven-source-plugin:3.0.1:jar (default) @ commons-rdf-api <<<
[INFO]
[INFO] --- maven-source-plugin:3.0.1:jar (default) @ commons-rdf-api ---
[INFO] Building jar: <https://builds.apache.org/job/commons-rdf/ws/api/target/commons-rdf-api-0.4.0-SNAPSHOT-sources.jar>
[INFO]
[INFO] >>> maven-source-plugin:3.0.1:test-jar (default) @ commons-rdf-api >>>
[INFO]
[INFO] --- maven-enforcer-plugin:1.4.1:enforce (enforce-maven-3) @ commons-rdf-api ---
[INFO]
[INFO] --- build-helper-maven-plugin:1.10:parse-version (parse-version) @ commons-rdf-api ---
[INFO]
[INFO] --- maven-antrun-plugin:1.8:run (javadoc.resources) @ commons-rdf-api ---
[INFO] Executing tasks

main:
[INFO] Executed tasks
[WARNING] Failed to getClass for org.apache.maven.plugins.source.TestSourceJarMojo
[INFO]
[INFO] <<< maven-source-plugin:3.0.1:test-jar (default) @ commons-rdf-api <<<
[INFO]
[INFO] --- maven-source-plugin:3.0.1:test-jar (default) @ commons-rdf-api ---
[INFO] Building jar: <https://builds.apache.org/job/commons-rdf/ws/api/target/commons-rdf-api-0.4.0-SNAPSHOT-test-sources.jar>
[INFO]
[INFO] --- maven-jar-plugin:3.0.0:test-jar (test-jar) @ commons-rdf-api ---
[INFO] Building jar: <https://builds.apache.org/job/commons-rdf/ws/api/target/commons-rdf-api-0.4.0-SNAPSHOT-tests.jar>
[INFO]
[INFO] --- jacoco-maven-plugin:0.7.7.201606060606:check (check) @ commons-rdf-api ---
[INFO] Loading execution data file <https://builds.apache.org/job/commons-rdf/ws/api/target/jacoco.exec>
[INFO] Analyzed bundle 'commons-rdf-api' with 10 classes
[WARNING] Rule violated for bundle commons-rdf-api: classes covered ratio is 0.90, but expected minimum is 1.00
[WARNING] Rule violated for bundle commons-rdf-api: instructions covered ratio is 0.81, but expected minimum is 0.90
[WARNING] Rule violated for bundle commons-rdf-api: methods covered ratio is 0.80, but expected minimum is 0.95
[WARNING] Rule violated for bundle commons-rdf-api: branches covered ratio is 0.36, but expected minimum is 0.85
[WARNING] Rule violated for bundle commons-rdf-api: lines covered ratio is 0.78, but expected minimum is 0.90
[WARNING] Rule violated for bundle commons-rdf-api: complexity covered ratio is 0.70, but expected minimum is 0.85
[WARNING] Coverage checks have not been met. See log for details.
[INFO]
[INFO] --- japicmp-maven-plugin:0.9.1:cmp (default) @ commons-rdf-api ---
[INFO] Downloading: http://repo.maven.apache.org/maven2/org/apache/maven/maven-core/3.0.3/maven-core-3.0.3.pom
[INFO] Downloaded: http://repo.maven.apache.org/maven2/org/apache/maven/maven-core/3.0.3/maven-core-3.0.3.pom (7 KB at 429.8 KB/sec)
[INFO] Downloading: http://repo.maven.apache.org/maven2/org/apache/maven/maven/3.0.3/maven-3.0.3.pom
[INFO] Downloaded: http://repo.maven.apache.org/maven2/org/apache/maven/maven/3.0.3/maven-3.0.3.pom (23 KB at 1576.9 KB/sec)
[INFO] Downloading: http://repo.maven.apache.org/maven2/org/apache/maven/maven-model/3.0.3/maven-model-3.0.3.pom
[INFO] Downloaded: http://repo.maven.apache.org/maven2/org/apache/maven/maven-model/3.0.3/maven-model-3.0.3.pom (4 KB at 292.5 KB/sec)
[INFO] Downloading: http://repo.maven.apache.org/maven2/org/codehaus/plexus/plexus-utils/2.0.6/plexus-utils-2.0.6.pom
[INFO] Downloaded: http://repo.maven.apache.org/maven2/org/codehaus/plexus/plexus-utils/2.0.6/plexus-utils-2.0.6.pom (3 KB at 235.3 KB/sec)
[INFO] Downloading: http://repo.maven.apache.org/maven2/org/apache/maven/maven-settings/3.0.3/maven-settings-3.0.3.pom
[INFO] Downloaded: http://repo.maven.apache.org/maven2/org/apache/maven/maven-settings/3.0.3/maven-settings-3.0.3.pom (2 KB at 141.5 KB/sec)
[INFO] Downloading: http://repo.maven.apache.org/maven2/org/apache/maven/maven-settings-builder/3.0.3/maven-settings-builder-3.0.3.pom
[INFO] Downloaded: http://repo.maven.apache.org/maven2/org/apache/maven/maven-settings-builder/3.0.3/maven-settings-builder-3.0.3.pom (3 KB at 166.9 KB/sec)
[INFO] Downloading: http://repo.maven.apache.org/maven2/org/apache/maven/maven-repository-metadata/3.0.3/maven-repository-metadata-3.0.3.pom
[INFO] Downloaded: http://repo.maven.apache.org/maven2/org/apache/maven/maven-repository-metadata/3.0.3/maven-repository-metadata-3.0.3.pom (2 KB at 145.1 KB/sec)
[INFO] Downloading: http://repo.maven.apache.org/maven2/org/apache/maven/maven-artifact/3.0.3/maven-artifact-3.0.3.pom
[INFO] Downloaded: http://repo.maven.apache.org/maven2/org/apache/maven/maven-artifact/3.0.3/maven-artifact-3.0.3.pom (2 KB at 145.0 KB/sec)
[INFO] Downloading: http://repo.maven.apache.org/maven2/org/apache/maven/maven-plugin-api/3.0.3/maven-plugin-api-3.0.3.pom
[INFO] Downloaded: http://repo.maven.apache.org/maven2/org/apache/maven/maven-plugin-api/3.0.3/maven-plugin-api-3.0.3.pom (3 KB at 172.0 KB/sec)
[INFO] Downloading: http://repo.maven.apache.org/maven2/org/sonatype/sisu/sisu-inject-plexus/2.1.1/sisu-inject-plexus-2.1.1.pom
[INFO] Downloaded: http://repo.maven.apache.org/maven2/org/sonatype/sisu/sisu-inject-plexus/2.1.1/sisu-inject-plexus-2.1.1.pom (3 KB at 209.9 KB/sec)
[INFO] Downloading: http://repo.maven.apache.org/maven2/org/sonatype/sisu/inject/guice-plexus/2.1.1/guice-plexus-2.1.1.pom
[INFO] Downloaded: http://repo.maven.apache.org/maven2/org/sonatype/sisu/inject/guice-plexus/2.1.1/guice-plexus-2.1.1.pom (4 KB at 267.1 KB/sec)
[INFO] Downloading: http://repo.maven.apache.org/maven2/org/sonatype/sisu/inject/guice-bean/2.1.1/guice-bean-2.1.1.pom
[INFO] Downloaded: http://repo.maven.apache.org/maven2/org/sonatype/sisu/inject/guice-bean/2.1.1/guice-bean-2.1.1.pom (3 KB at 229.1 KB/sec)
[INFO] Downloading: http://repo.maven.apache.org/maven2/org/sonatype/sisu/sisu-inject/2.1.1/sisu-inject-2.1.1.pom
[INFO] Downloaded: http://repo.maven.apache.org/maven2/org/sonatype/sisu/sisu-inject/2.1.1/sisu-inject-2.1.1.pom (2 KB at 133.0 KB/sec)
[INFO] Downloading: http://repo.maven.apache.org/maven2/org/sonatype/sisu/sisu-parent/2.1.1/sisu-parent-2.1.1.pom
[INFO] Downloaded: http://repo.maven.apache.org/maven2/org/sonatype/sisu/sisu-parent/2.1.1/sisu-parent-2.1.1.pom (10 KB at 646.5 KB/sec)
[INFO] Downloading: http://repo.maven.apache.org/maven2/org/sonatype/forge/forge-parent/7/forge-parent-7.pom
[INFO] Downloaded: http://repo.maven.apache.org/maven2/org/sonatype/forge/forge-parent/7/forge-parent-7.pom (13 KB at 953.2 KB/sec)
[INFO] Downloading: http://repo.maven.apache.org/maven2/org/codehaus/plexus/plexus-classworlds/2.4/plexus-classworlds-2.4.pom
[INFO] Downloaded: http://repo.maven.apache.org/maven2/org/codehaus/plexus/plexus-classworlds/2.4/plexus-classworlds-2.4.pom (4 KB at 291.7 KB/sec)
[INFO] Downloading: http://repo.maven.apache.org/maven2/org/sonatype/sisu/sisu-inject-bean/2.1.1/sisu-inject-bean-2.1.1.pom
[INFO] Downloaded: http://repo.maven.apache.org/maven2/org/sonatype/sisu/sisu-inject-bean/2.1.1/sisu-inject-bean-2.1.1.pom (3 KB at 209.1 KB/sec)
[INFO] Downloading: http://repo.maven.apache.org/maven2/org/sonatype/sisu/sisu-guice/2.9.4/sisu-guice-2.9.4.pom
[INFO] Downloaded: http://repo.maven.apache.org/maven2/org/sonatype/sisu/sisu-guice/2.9.4/sisu-guice-2.9.4.pom (8 KB at 547.3 KB/sec)
[INFO] Downloading: http://repo.maven.apache.org/maven2/org/sonatype/sisu/inject/guice-parent/2.9.4/guice-parent-2.9.4.pom
[INFO] Downloaded: http://repo.maven.apache.org/maven2/org/sonatype/sisu/inject/guice-parent/2.9.4/guice-parent-2.9.4.pom (13 KB at 973.3 KB/sec)
[INFO] Downloading: http://repo.maven.apache.org/maven2/org/apache/maven/maven-model-builder/3.0.3/maven-model-builder-3.0.3.pom
[INFO] Downloaded: http://repo.maven.apache.org/maven2/org/apache/maven/maven-model-builder/3.0.3/maven-model-builder-3.0.3.pom (3 KB at 168.9 KB/sec)
[INFO] Downloading: http://repo.maven.apache.org/maven2/org/apache/maven/maven-aether-provider/3.0.3/maven-aether-provider-3.0.3.pom
[INFO] Downloaded: http://repo.maven.apache.org/maven2/org/apache/maven/maven-aether-provider/3.0.3/maven-aether-provider-3.0.3.pom (3 KB at 214.1 KB/sec)
[INFO] Downloading: http://repo.maven.apache.org/maven2/org/sonatype/aether/aether-api/1.11/aether-api-1.11.pom
[INFO] Downloaded: http://repo.maven.apache.org/maven2/org/sonatype/aether/aether-api/1.11/aether-api-1.11.pom (2 KB at 114.4 KB/sec)
[INFO] Downloading: http://repo.maven.apache.org/maven2/org/sonatype/aether/aether-parent/1.11/aether-parent-1.11.pom
[INFO] Downloaded: http://repo.maven.apache.org/maven2/org/sonatype/aether/aether-parent/1.11/aether-parent-1.11.pom (12 KB at 787.0 KB/sec)
[INFO] Downloading: http://repo.maven.apache.org/maven2/org/sonatype/aether/aether-spi/1.11/aether-spi-1.11.pom
[INFO] Downloaded: http://repo.maven.apache.org/maven2/org/sonatype/aether/aether-spi/1.11/aether-spi-1.11.pom (2 KB at 116.1 KB/sec)
[INFO] Downloading: http://repo.maven.apache.org/maven2/org/sonatype/aether/aether-util/1.11/aether-util-1.11.pom
[INFO] Downloaded: http://repo.maven.apache.org/maven2/org/sonatype/aether/aether-util/1.11/aether-util-1.11.pom (2 KB at 136.9 KB/sec)
[INFO] Downloading: http://repo.maven.apache.org/maven2/org/sonatype/aether/aether-impl/1.11/aether-impl-1.11.pom
[INFO] Downloaded: http://repo.maven.apache.org/maven2/org/sonatype/aether/aether-impl/1.11/aether-impl-1.11.pom (4 KB at 240.2 KB/sec)
[INFO] Downloading: http://repo.maven.apache.org/maven2/com/github/siom79/japicmp/japicmp/0.9.1/japicmp-0.9.1.pom
[INFO] Downloaded: http://repo.maven.apache.org/maven2/com/github/siom79/japicmp/japicmp/0.9.1/japicmp-0.9.1.pom (4 KB at 40.2 KB/sec)
[INFO] Downloading: http://repo.maven.apache.org/maven2/org/javassist/javassist/3.20.0-GA/javassist-3.20.0-GA.pom
[INFO] Downloaded: http://repo.maven.apache.org/maven2/org/javassist/javassist/3.20.0-GA/javassist-3.20.0-GA.pom (10 KB at 639.7 KB/sec)
[INFO] Downloading: http://repo.maven.apache.org/maven2/com/google/guava/guava/18.0/guava-18.0.pom
[INFO] Downloaded: http://repo.maven.apache.org/maven2/com/google/guava/guava/18.0/guava-18.0.pom (6 KB at 425.6 KB/sec)
[INFO] Downloading: http://repo.maven.apache.org/maven2/com/google/guava/guava-parent/18.0/guava-parent-18.0.pom
[INFO] Downloaded: http://repo.maven.apache.org/maven2/com/google/guava/guava-parent/18.0/guava-parent-18.0.pom (8 KB at 577.4 KB/sec)
[INFO] Downloading: http://repo.maven.apache.org/maven2/io/airlift/airline/0.7/airline-0.7.pom
[INFO] Downloaded: http://repo.maven.apache.org/maven2/io/airlift/airline/0.7/airline-0.7.pom (3 KB at 188.1 KB/sec)
[INFO] Downloading: http://repo.maven.apache.org/maven2/io/airlift/airbase/28/airbase-28.pom
[INFO] Downloaded: http://repo.maven.apache.org/maven2/io/airlift/airbase/28/airbase-28.pom (60 KB at 3985.0 KB/sec)
[INFO] Downloading: http://repo.maven.apache.org/maven2/javax/inject/javax.inject/1/javax.inject-1.pom
[INFO] Downloaded: http://repo.maven.apache.org/maven2/javax/inject/javax.inject/1/javax.inject-1.pom (612 B at 49.8 KB/sec)
[INFO] Downloading: http://repo.maven.apache.org/maven2/com/google/code/findbugs/annotations/2.0.3/annotations-2.0.3.pom
[INFO] Downloaded: http://repo.maven.apache.org/maven2/com/google/code/findbugs/annotations/2.0.3/annotations-2.0.3.pom (4 KB at 244.6 KB/sec)
[INFO] Downloading: http://repo.maven.apache.org/maven2/org/apache/maven/maven-compat/3.0.3/maven-compat-3.0.3.pom
[INFO] Downloaded: http://repo.maven.apache.org/maven2/org/apache/maven/maven-compat/3.0.3/maven-compat-3.0.3.pom (4 KB at 302.2 KB/sec)
[INFO] Downloading: http://repo.maven.apache.org/maven2/org/apache/maven/wagon/wagon-provider-api/1.0-beta-7/wagon-provider-api-1.0-beta-7.pom
[INFO] Downloaded: http://repo.maven.apache.org/maven2/org/apache/maven/wagon/wagon-provider-api/1.0-beta-7/wagon-provider-api-1.0-beta-7.pom (2 KB at 126.0 KB/sec)
[INFO] Downloading: http://repo.maven.apache.org/maven2/org/apache/maven/wagon/wagon/1.0-beta-7/wagon-1.0-beta-7.pom
[INFO] Downloaded: http://repo.maven.apache.org/maven2/org/apache/maven/wagon/wagon/1.0-beta-7/wagon-1.0-beta-7.pom (12 KB at 819.6 KB/sec)
[INFO] Downloading: http://repo.maven.apache.org/maven2/org/apache/maven/reporting/maven-reporting-impl/2.3/maven-reporting-impl-2.3.pom
[INFO] Downloaded: http://repo.maven.apache.org/maven2/org/apache/maven/reporting/maven-reporting-impl/2.3/maven-reporting-impl-2.3.pom (5 KB at 375.6 KB/sec)
[INFO] Downloading: http://repo.maven.apache.org/maven2/org/apache/maven/shared/maven-shared-utils/0.6/maven-shared-utils-0.6.pom
[INFO] Downloaded: http://repo.maven.apache.org/maven2/org/apache/maven/shared/maven-shared-utils/0.6/maven-shared-utils-0.6.pom (5 KB at 340.3 KB/sec)
[INFO] Downloading: http://repo.maven.apache.org/maven2/org/apache/maven/doxia/doxia-sink-api/1.2/doxia-sink-api-1.2.pom
[INFO] Downloaded: http://repo.maven.apache.org/maven2/org/apache/maven/doxia/doxia-sink-api/1.2/doxia-sink-api-1.2.pom (2 KB at 133.4 KB/sec)
[INFO] Downloading: http://repo.maven.apache.org/maven2/org/apache/maven/doxia/doxia/1.2/doxia-1.2.pom
[INFO] Downloaded: http://repo.maven.apache.org/maven2/org/apache/maven/doxia/doxia/1.2/doxia-1.2.pom (19 KB at 1532.1 KB/sec)
[INFO] Downloading: http://repo.maven.apache.org/maven2/org/apache/maven/maven-parent/19/maven-parent-19.pom
[INFO] Downloaded: http://repo.maven.apache.org/maven2/org/apache/maven/maven-parent/19/maven-parent-19.pom (25 KB at 1878.5 KB/sec)
[INFO] Downloading: http://repo.maven.apache.org/maven2/org/apache/maven/doxia/doxia-logging-api/1.2/doxia-logging-api-1.2.pom
[INFO] Downloaded: http://repo.maven.apache.org/maven2/org/apache/maven/doxia/doxia-logging-api/1.2/doxia-logging-api-1.2.pom (2 KB at 123.7 KB/sec)
[INFO] Downloading: http://repo.maven.apache.org/maven2/org/apache/maven/doxia/doxia-core/1.2/doxia-core-1.2.pom
[INFO] Downloaded: http://repo.maven.apache.org/maven2/org/apache/maven/doxia/doxia-core/1.2/doxia-core-1.2.pom (4 KB at 297.1 KB/sec)
[INFO] Downloading: http://repo.maven.apache.org/maven2/org/apache/maven/doxia/doxia-site-renderer/1.2/doxia-site-renderer-1.2.pom
[INFO] Downloaded: http://repo.maven.apache.org/maven2/org/apache/maven/doxia/doxia-site-renderer/1.2/doxia-site-renderer-1.2.pom (7 KB at 468.6 KB/sec)
[INFO] Downloading: http://repo.maven.apache.org/maven2/org/apache/maven/doxia/doxia-sitetools/1.2/doxia-sitetools-1.2.pom
[INFO] Downloaded: http://repo.maven.apache.org/maven2/org/apache/maven/doxia/doxia-sitetools/1.2/doxia-sitetools-1.2.pom (16 KB at 1307.4 KB/sec)
[INFO] Downloading: http://repo.maven.apache.org/maven2/org/apache/maven/doxia/doxia-decoration-model/1.2/doxia-decoration-model-1.2.pom
[INFO] Downloaded: http://repo.maven.apache.org/maven2/org/apache/maven/doxia/doxia-decoration-model/1.2/doxia-decoration-model-1.2.pom (3 KB at 248.8 KB/sec)
[INFO] Downloading: http://repo.maven.apache.org/maven2/org/apache/maven/doxia/doxia-module-xhtml/1.2/doxia-module-xhtml-1.2.pom
[INFO] Downloaded: http://repo.maven.apache.org/maven2/org/apache/maven/doxia/doxia-module-xhtml/1.2/doxia-module-xhtml-1.2.pom (2 KB at 143.2 KB/sec)
[INFO] Downloading: http://repo.maven.apache.org/maven2/org/apache/maven/doxia/doxia-modules/1.2/doxia-modules-1.2.pom
[INFO] Downloaded: http://repo.maven.apache.org/maven2/org/apache/maven/doxia/doxia-modules/1.2/doxia-modules-1.2.pom (3 KB at 187.8 KB/sec)
[INFO] Downloading: http://repo.maven.apache.org/maven2/org/apache/maven/doxia/doxia-module-fml/1.2/doxia-module-fml-1.2.pom
[INFO] Downloaded: http://repo.maven.apache.org/maven2/org/apache/maven/doxia/doxia-module-fml/1.2/doxia-module-fml-1.2.pom (6 KB at 422.6 KB/sec)
[INFO] Downloading: http://repo.maven.apache.org/maven2/org/codehaus/groovy/groovy-jsr223/2.4.6/groovy-jsr223-2.4.6.pom
[INFO] Downloaded: http://repo.maven.apache.org/maven2/org/codehaus/groovy/groovy-jsr223/2.4.6/groovy-jsr223-2.4.6.pom (16 KB at 1080.1 KB/sec)
[INFO] Downloading: http://repo.maven.apache.org/maven2/org/codehaus/groovy/groovy/2.4.6/groovy-2.4.6.pom
[INFO] Downloaded: http://repo.maven.apache.org/maven2/org/codehaus/groovy/groovy/2.4.6/groovy-2.4.6.pom (17 KB at 1269.8 KB/sec)
[INFO] Downloading: http://repo.maven.apache.org/maven2/org/sonatype/aether/aether-util/1.11/aether-util-1.11.jar
[INFO] Downloading: http://repo.maven.apache.org/maven2/org/sonatype/sisu/sisu-inject-bean/2.1.1/sisu-inject-bean-2.1.1.jar
[INFO] Downloading: http://repo.maven.apache.org/maven2/org/sonatype/sisu/sisu-guice/2.9.4/sisu-guice-2.9.4-no_aop.jar
[INFO] Downloading: http://repo.maven.apache.org/maven2/org/codehaus/plexus/plexus-utils/2.0.6/plexus-utils-2.0.6.jar
[INFO] Downloading: http://repo.maven.apache.org/maven2/com/github/siom79/japicmp/japicmp/0.9.1/japicmp-0.9.1.jar
[INFO] Downloaded: http://repo.maven.apache.org/maven2/org/sonatype/aether/aether-util/1.11/aether-util-1.11.jar (118 KB at 6883.5 KB/sec)
[INFO] Downloading: http://repo.maven.apache.org/maven2/org/javassist/javassist/3.20.0-GA/javassist-3.20.0-GA.jar
[INFO] Downloaded: http://repo.maven.apache.org/maven2/org/sonatype/sisu/sisu-inject-bean/2.1.1/sisu-inject-bean-2.1.1.jar (225 KB at 10202.9 KB/sec)
[INFO] Downloading: http://repo.maven.apache.org/maven2/com/google/guava/guava/18.0/guava-18.0.jar
[INFO] Downloaded: http://repo.maven.apache.org/maven2/org/codehaus/plexus/plexus-utils/2.0.6/plexus-utils-2.0.6.jar (219 KB at 9917.7 KB/sec)
[INFO] Downloading: http://repo.maven.apache.org/maven2/io/airlift/airline/0.7/airline-0.7.jar
[INFO] Downloaded: http://repo.maven.apache.org/maven2/org/sonatype/sisu/sisu-guice/2.9.4/sisu-guice-2.9.4-no_aop.jar (473 KB at 18163.8 KB/sec)
[INFO] Downloading: http://repo.maven.apache.org/maven2/javax/inject/javax.inject/1/javax.inject-1.jar
[INFO] Downloaded: http://repo.maven.apache.org/maven2/io/airlift/airline/0.7/airline-0.7.jar (84 KB at 5593.2 KB/sec)
[INFO] Downloading: http://repo.maven.apache.org/maven2/com/google/code/findbugs/annotations/2.0.3/annotations-2.0.3.jar
[INFO] Downloaded: http://repo.maven.apache.org/maven2/javax/inject/javax.inject/1/javax.inject-1.jar (3 KB at 187.6 KB/sec)
[INFO] Downloading: http://repo.maven.apache.org/maven2/org/apache/maven/reporting/maven-reporting-impl/2.3/maven-reporting-impl-2.3.jar
[INFO] Downloaded: http://repo.maven.apache.org/maven2/org/apache/maven/reporting/maven-reporting-impl/2.3/maven-reporting-impl-2.3.jar (18 KB at 1350.5 KB/sec)
[INFO] Downloading: http://repo.maven.apache.org/maven2/org/apache/maven/shared/maven-shared-utils/0.6/maven-shared-utils-0.6.jar
[INFO] Downloaded: http://repo.maven.apache.org/maven2/org/javassist/javassist/3.20.0-GA/javassist-3.20.0-GA.jar (733 KB at 20942.6 KB/sec)
[INFO] Downloaded: http://repo.maven.apache.org/maven2/com/google/code/findbugs/annotations/2.0.3/annotations-2.0.3.jar (76 KB at 5025.1 KB/sec)
[INFO] Downloading: http://repo.maven.apache.org/maven2/org/apache/maven/doxia/doxia-sink-api/1.2/doxia-sink-api-1.2.jar
[INFO] Downloading: http://repo.maven.apache.org/maven2/org/apache/maven/doxia/doxia-core/1.2/doxia-core-1.2.jar
[INFO] Downloaded: http://repo.maven.apache.org/maven2/org/apache/maven/doxia/doxia-sink-api/1.2/doxia-sink-api-1.2.jar (11 KB at 784.0 KB/sec)
[INFO] Downloading: http://repo.maven.apache.org/maven2/org/apache/maven/doxia/doxia-site-renderer/1.2/doxia-site-renderer-1.2.jar
[INFO] Downloaded: http://repo.maven.apache.org/maven2/org/apache/maven/doxia/doxia-core/1.2/doxia-core-1.2.jar (151 KB at 9406.8 KB/sec)
[INFO] Downloading: http://repo.maven.apache.org/maven2/org/apache/maven/doxia/doxia-decoration-model/1.2/doxia-decoration-model-1.2.jar
[INFO] Downloaded: http://repo.maven.apache.org/maven2/org/apache/maven/shared/maven-shared-utils/0.6/maven-shared-utils-0.6.jar (161 KB at 9457.3 KB/sec)
[INFO] Downloading: http://repo.maven.apache.org/maven2/org/apache/maven/doxia/doxia-module-xhtml/1.2/doxia-module-xhtml-1.2.jar
[INFO] Downloaded: http://repo.maven.apache.org/maven2/org/apache/maven/doxia/doxia-site-renderer/1.2/doxia-site-renderer-1.2.jar (51 KB at 3633.6 KB/sec)
[INFO] Downloading: http://repo.maven.apache.org/maven2/org/apache/maven/doxia/doxia-module-fml/1.2/doxia-module-fml-1.2.jar
[INFO] Downloaded: http://repo.maven.apache.org/maven2/org/apache/maven/doxia/doxia-module-xhtml/1.2/doxia-module-xhtml-1.2.jar (15 KB at 1134.0 KB/sec)
[INFO] Downloading: http://repo.maven.apache.org/maven2/org/codehaus/groovy/groovy-jsr223/2.4.6/groovy-jsr223-2.4.6.jar
[INFO] Downloaded: http://repo.maven.apache.org/maven2/com/google/guava/guava/18.0/guava-18.0.jar (2204 KB at 36120.2 KB/sec)
[INFO] Downloading: http://repo.maven.apache.org/maven2/org/codehaus/groovy/groovy/2.4.6/groovy-2.4.6.jar
[INFO] Downloaded: http://repo.maven.apache.org/maven2/org/apache/maven/doxia/doxia-decoration-model/1.2/doxia-decoration-model-1.2.jar (59 KB at 3889.0 KB/sec)
[INFO] Downloaded: http://repo.maven.apache.org/maven2/org/apache/maven/doxia/doxia-module-fml/1.2/doxia-module-fml-1.2.jar (37 KB at 2640.8 KB/sec)
[INFO] Downloaded: http://repo.maven.apache.org/maven2/org/codehaus/groovy/groovy-jsr223/2.4.6/groovy-jsr223-2.4.6.jar (21 KB at 1432.8 KB/sec)
[INFO] Downloaded: http://repo.maven.apache.org/maven2/org/codehaus/groovy/groovy/2.4.6/groovy-2.4.6.jar (4452 KB at 47360.3 KB/sec)
[INFO] Downloaded: http://repo.maven.apache.org/maven2/com/github/siom79/japicmp/japicmp/0.9.1/japicmp-0.9.1.jar (216 KB at 719.3 KB/sec)
[INFO] artifact org.apache.commons:commons-rdf-api: checking for updates from Nexus
[INFO] artifact org.apache.commons:commons-rdf-api: checking for updates from central
[INFO] Downloading: http://repo.maven.apache.org/maven2/org/apache/commons/commons-rdf-api/0.3.0-incubating/commons-rdf-api-0.3.0-incubating.jar
[INFO] Downloaded: http://repo.maven.apache.org/maven2/org/apache/commons/commons-rdf-api/0.3.0-incubating/commons-rdf-api-0.3.0-incubating.jar (19 KB at 1242.3 KB/sec)
[INFO] Written file '<https://builds.apache.org/job/commons-rdf/ws/api/target/japicmp/japicmp.diff'.>
[INFO] Written file '<https://builds.apache.org/job/commons-rdf/ws/api/target/japicmp/japicmp.xml'.>
[INFO] Written file '<https://builds.apache.org/job/commons-rdf/ws/api/target/japicmp/japicmp.html'.>
[INFO] ------------------------------------------------------------------------
[INFO] Reactor Summary:
[INFO]
[INFO] Commons RDF ....................................... SUCCESS [ 17.422 s]
[INFO] Commons RDF API ................................... FAILURE [ 45.036 s]
[INFO] Commons RDF impl: Simple .......................... SKIPPED
[INFO] Commons RDF impl: RDF4j ........................... SKIPPED
[INFO] Commons RDF impl: Jena ............................ SKIPPED
[INFO] Commons RDF impl: JSON-LD Java .................... SKIPPED
[INFO] Commons RDF Integration tests ..................... SKIPPED
[INFO] ------------------------------------------------------------------------
[INFO] BUILD FAILURE
[INFO] ------------------------------------------------------------------------
[INFO] Total time: 01:05 min
[INFO] Finished at: 2017-06-15T11:48:33+00:00
[INFO] Final Memory: 46M/732M
[INFO] ------------------------------------------------------------------------
Waiting for Jenkins to finish collecting data
[ERROR] Failed to execute goal com.github.siom79.japicmp:japicmp-maven-plugin:0.9.1:cmp (default) on project commons-rdf-api: Breaking the build because there is at least one incompatibility: org.apache.commons.rdf.api.RDFSyntax.byName(java.lang.String):METHOD_ADDED_TO_INTERFACE,org.apache.commons.rdf.api.RDFSyntax.equals(java.lang.Object):METHOD_ADDED_TO_INTERFACE,org.apache.commons.rdf.api.RDFSyntax.fileExtension():METHOD_ADDED_TO_INTERFACE,org.apache.commons.rdf.api.RDFSyntax.fileExtensions():METHOD_ADDED_TO_INTERFACE,org.apache.commons.rdf.api.RDFSyntax.hashCode():METHOD_ADDED_TO_INTERFACE,org.apache.commons.rdf.api.RDFSyntax.iri():METHOD_ADDED_TO_INTERFACE,org.apache.commons.rdf.api.RDFSyntax.mediaType():METHOD_ADDED_TO_INTERFACE,org.apache.commons.rdf.api.RDFSyntax.mediaTypes():METHOD_ADDED_TO_INTERFACE,org.apache.commons.rdf.api.RDFSyntax.name():METHOD_ADDED_TO_INTERFACE,org.apache.commons.rdf.api.RDFSyntax.supportsDataset():METHOD_ADDED_TO_INTERFACE,org.apache.commons.rdf.api.RDFSyntax.title():METHOD_ADDED_TO_INTERFACE,org.apache.commons.rdf.api.RDFSyntax.valueOf(java.lang.String):METHOD_REMOVED,org.apache.commons.rdf.api.RDFSyntax.values():METHOD_REMOVED,org.apache.commons.rdf.api.RDFSyntax.w3cSyntaxes():METHOD_ADDED_TO_INTERFACE,java.lang.Comparable[java.lang.Comparable]:INTERFACE_REMOVED,java.io.Serializable[java.io.Serializable]:INTERFACE_REMOVED,org.apache.commons.rdf.api.RDFSyntax:SUPERCLASS_REMOVED,org.apache.commons.rdf.api.RDFSyntax.RDFA_XHTML:FIELD_REMOVED,org.apache.commons.rdf.api.RDFSyntax.RDFA_HTML:FIELD_REMOVED,org.apache.commons.rdf.api.RDFSyntax.mediaType:FIELD_REMOVED,org.apache.commons.rdf.api.RDFSyntax.supportsDataset:FIELD_REMOVED,org.apache.commons.rdf.api.RDFSyntax.fileExtension:FIELD_REMOVED,org.apache.commons.rdf.api.RDFSyntax:CLASS_NOW_ABSTRACT,org.apache.commons.rdf.api.RDFSyntax:CLASS_TYPE_CHANGED -> [Help 1]
[ERROR]
[ERROR] To see the full stack trace of the errors, re-run Maven with the -e switch.
[ERROR] Re-run Maven using the -X switch to enable full debug logging.
[ERROR]
[ERROR] For more information about the errors and possible solutions, please read the following articles:
[ERROR] [Help 1] http://cwiki.apache.org/confluence/display/MAVEN/MojoFailureException
[ERROR]
[ERROR] After correcting the problems, you can resume the build with the command
[ERROR]   mvn <goals> -rf :commons-rdf-api
[JENKINS] Archiving <https://builds.apache.org/job/commons-rdf/ws/jsonld-java/pom.xml> to org.apache.commons/commons-rdf-jsonld-java/0.4.0-SNAPSHOT/commons-rdf-jsonld-java-0.4.0-SNAPSHOT.pom
[JENKINS] Archiving <https://builds.apache.org/job/commons-rdf/ws/jena/pom.xml> to org.apache.commons/commons-rdf-jena/0.4.0-SNAPSHOT/commons-rdf-jena-0.4.0-SNAPSHOT.pom
[JENKINS] Archiving <https://builds.apache.org/job/commons-rdf/ws/simple/pom.xml> to org.apache.commons/commons-rdf-simple/0.4.0-SNAPSHOT/commons-rdf-simple-0.4.0-SNAPSHOT.pom
[JENKINS] Archiving <https://builds.apache.org/job/commons-rdf/ws/api/pom.xml> to org.apache.commons/commons-rdf-api/0.4.0-SNAPSHOT/commons-rdf-api-0.4.0-SNAPSHOT.pom
[JENKINS] Archiving <https://builds.apache.org/job/commons-rdf/ws/api/target/commons-rdf-api-0.4.0-SNAPSHOT.jar> to org.apache.commons/commons-rdf-api/0.4.0-SNAPSHOT/commons-rdf-api-0.4.0-SNAPSHOT.jar
[JENKINS] Archiving <https://builds.apache.org/job/commons-rdf/ws/api/target/commons-rdf-api-0.4.0-SNAPSHOT-javadoc.jar> to org.apache.commons/commons-rdf-api/0.4.0-SNAPSHOT/commons-rdf-api-0.4.0-SNAPSHOT-javadoc.jar
[JENKINS] Archiving <https://builds.apache.org/job/commons-rdf/ws/api/target/commons-rdf-api-0.4.0-SNAPSHOT-sources.jar> to org.apache.commons/commons-rdf-api/0.4.0-SNAPSHOT/commons-rdf-api-0.4.0-SNAPSHOT-sources.jar
[JENKINS] Archiving <https://builds.apache.org/job/commons-rdf/ws/api/target/commons-rdf-api-0.4.0-SNAPSHOT-test-sources.jar> to org.apache.commons/commons-rdf-api/0.4.0-SNAPSHOT/commons-rdf-api-0.4.0-SNAPSHOT-test-sources.jar
[JENKINS] Archiving <https://builds.apache.org/job/commons-rdf/ws/api/target/commons-rdf-api-0.4.0-SNAPSHOT-tests.jar> to org.apache.commons/commons-rdf-api/0.4.0-SNAPSHOT/commons-rdf-api-0.4.0-SNAPSHOT-tests.jar
[JENKINS] Archiving <https://builds.apache.org/job/commons-rdf/ws/pom.xml> to org.apache.commons/commons-rdf-parent/0.4.0-SNAPSHOT/commons-rdf-parent-0.4.0-SNAPSHOT.pom
[JENKINS] Archiving <https://builds.apache.org/job/commons-rdf/ws/target/commons-rdf-parent-0.4.0-SNAPSHOT-site.xml> to org.apache.commons/commons-rdf-parent/0.4.0-SNAPSHOT/commons-rdf-parent-0.4.0-SNAPSHOT-site.xml
[JENKINS] Archiving <https://builds.apache.org/job/commons-rdf/ws/rdf4j/pom.xml> to org.apache.commons/commons-rdf-rdf4j/0.4.0-SNAPSHOT/commons-rdf-rdf4j-0.4.0-SNAPSHOT.pom
[JENKINS] Archiving <https://builds.apache.org/job/commons-rdf/ws/integration-tests/pom.xml> to org.apache.commons/commons-rdf-integration-tests/0.4.0-SNAPSHOT/commons-rdf-integration-tests-0.4.0-SNAPSHOT.pom
channel stopped

---------------------------------------------------------------------
To unsubscribe, e-mail: [hidden email]
For additional commands, e-mail: [hidden email]