Build failed in Jenkins: commons-validator #38

classic Classic list List threaded Threaded
10 messages Options
Reply | Threaded
Open this post in threaded view
|

Build failed in Jenkins: commons-validator #38

Apache Jenkins Server
See <https://builds.apache.org/job/commons-validator/38/display/redirect?page=changes>

Changes:

[sebb] 1.6 Released

[sebb] Fix layout

------------------------------------------
Started by an SCM change
[EnvInject] - Loading node environment variables.
Building remotely on ubuntu-1 (ubuntu) in workspace <https://builds.apache.org/job/commons-validator/ws/>
Updating https://svn.apache.org/repos/asf/commons/proper/validator/trunk at revision '2017-02-21T12:05:11.635 +0000'
U         RELEASE-NOTES.txt
U         src/changes/changes.xml
U         pom.xml
At revision 1783877

Parsing POMs
Established TCP socket on 51758
Copied maven32-agent.jar
Copied maven32-interceptor.jar
maven3-interceptor-commons.jar already up to date
[commons-validator] $ /home/jenkins/tools/java/latest1.6/bin/java -Xmx2g -Xms256m -cp /home/jenkins/jenkins-slave/maven32-agent.jar:/home/jenkins/tools/maven/apache-maven-3.2.5/boot/plexus-classworlds-2.5.2.jar:/home/jenkins/tools/maven/apache-maven-3.2.5/conf/logging jenkins.maven3.agent.Maven32Main /home/jenkins/tools/maven/apache-maven-3.2.5 /home/jenkins/jenkins-slave/slave.jar /home/jenkins/jenkins-slave/maven32-interceptor.jar /home/jenkins/jenkins-slave/maven3-interceptor-commons.jar 51758
Exception in thread "main" java.lang.UnsupportedClassVersionError: hudson/remoting/Launcher : Unsupported major.minor version 51.0
        at java.lang.ClassLoader.defineClass1(Native Method)
        at java.lang.ClassLoader.defineClassCond(ClassLoader.java:631)
        at java.lang.ClassLoader.defineClass(ClassLoader.java:615)
        at java.security.SecureClassLoader.defineClass(SecureClassLoader.java:141)
        at java.net.URLClassLoader.defineClass(URLClassLoader.java:283)
        at java.net.URLClassLoader.access$000(URLClassLoader.java:58)
        at java.net.URLClassLoader$1.run(URLClassLoader.java:197)
        at java.security.AccessController.doPrivileged(Native Method)
        at java.net.URLClassLoader.findClass(URLClassLoader.java:190)
        at org.codehaus.plexus.classworlds.realm.ClassRealm.loadClassFromSelf(ClassRealm.java:401)
        at org.codehaus.plexus.classworlds.strategy.SelfFirstStrategy.loadClass(SelfFirstStrategy.java:42)
        at org.codehaus.plexus.classworlds.realm.ClassRealm.unsynchronizedLoadClass(ClassRealm.java:271)
        at org.codehaus.plexus.classworlds.realm.ClassRealm.loadClass(ClassRealm.java:254)
        at org.codehaus.plexus.classworlds.realm.ClassRealm.loadClass(ClassRealm.java:239)
        at jenkins.maven3.agent.Maven32Main.main(Maven32Main.java:143)
        at jenkins.maven3.agent.Maven32Main.main(Maven32Main.java:74)
ERROR: Failed to parse POMs
java.io.EOFException: unexpected stream termination
        at hudson.remoting.ChannelBuilder.negotiate(ChannelBuilder.java:365)
        at hudson.remoting.ChannelBuilder.build(ChannelBuilder.java:310)
        at hudson.slaves.Channels.forProcess(Channels.java:115)
        at hudson.maven.AbstractMavenProcessFactory.newProcess(AbstractMavenProcessFactory.java:294)
        at hudson.maven.ProcessCache.get(ProcessCache.java:236)
        at hudson.maven.MavenModuleSetBuild$MavenModuleSetBuildExecution.doRun(MavenModuleSetBuild.java:798)
        at hudson.model.AbstractBuild$AbstractBuildExecution.run(AbstractBuild.java:534)
        at hudson.model.Run.execute(Run.java:1728)
        at hudson.maven.MavenModuleSetBuild.run(MavenModuleSetBuild.java:544)
        at hudson.model.ResourceController.execute(ResourceController.java:98)
        at hudson.model.Executor.run(Executor.java:404)

---------------------------------------------------------------------
To unsubscribe, e-mail: [hidden email]
For additional commands, e-mail: [hidden email]

Reply | Threaded
Open this post in threaded view
|

Build failed in Jenkins: commons-validator #39

Apache Jenkins Server
See <https://builds.apache.org/job/commons-validator/39/display/redirect>

------------------------------------------
Started by user sebb
[EnvInject] - Loading node environment variables.
Building remotely on ubuntu-1 (ubuntu) in workspace <https://builds.apache.org/job/commons-validator/ws/>
Updating https://svn.apache.org/repos/asf/commons/proper/validator/trunk at revision '2017-02-21T15:00:12.349 +0000'
At revision 1783899

No changes for https://svn.apache.org/repos/asf/commons/proper/validator/trunk since the previous build
Parsing POMs
Established TCP socket on 32827
maven32-agent.jar already up to date
maven32-interceptor.jar already up to date
maven3-interceptor-commons.jar already up to date
[commons-validator] $ /home/jenkins/tools/java/latest1.6/bin/java -Xmx2g -Xms256m -cp /home/jenkins/jenkins-slave/maven32-agent.jar:/home/jenkins/tools/maven/apache-maven-3.2.5/boot/plexus-classworlds-2.5.2.jar:/home/jenkins/tools/maven/apache-maven-3.2.5/conf/logging jenkins.maven3.agent.Maven32Main /home/jenkins/tools/maven/apache-maven-3.2.5 /home/jenkins/jenkins-slave/slave.jar /home/jenkins/jenkins-slave/maven32-interceptor.jar /home/jenkins/jenkins-slave/maven3-interceptor-commons.jar 32827
Exception in thread "main" java.lang.UnsupportedClassVersionError: hudson/remoting/Launcher : Unsupported major.minor version 51.0
        at java.lang.ClassLoader.defineClass1(Native Method)
        at java.lang.ClassLoader.defineClassCond(ClassLoader.java:631)
        at java.lang.ClassLoader.defineClass(ClassLoader.java:615)
        at java.security.SecureClassLoader.defineClass(SecureClassLoader.java:141)
        at java.net.URLClassLoader.defineClass(URLClassLoader.java:283)
        at java.net.URLClassLoader.access$000(URLClassLoader.java:58)
        at java.net.URLClassLoader$1.run(URLClassLoader.java:197)
        at java.security.AccessController.doPrivileged(Native Method)
        at java.net.URLClassLoader.findClass(URLClassLoader.java:190)
        at org.codehaus.plexus.classworlds.realm.ClassRealm.loadClassFromSelf(ClassRealm.java:401)
        at org.codehaus.plexus.classworlds.strategy.SelfFirstStrategy.loadClass(SelfFirstStrategy.java:42)
        at org.codehaus.plexus.classworlds.realm.ClassRealm.unsynchronizedLoadClass(ClassRealm.java:271)
        at org.codehaus.plexus.classworlds.realm.ClassRealm.loadClass(ClassRealm.java:254)
        at org.codehaus.plexus.classworlds.realm.ClassRealm.loadClass(ClassRealm.java:239)
        at jenkins.maven3.agent.Maven32Main.main(Maven32Main.java:143)
        at jenkins.maven3.agent.Maven32Main.main(Maven32Main.java:74)
ERROR: Failed to parse POMs
java.io.EOFException: unexpected stream termination
        at hudson.remoting.ChannelBuilder.negotiate(ChannelBuilder.java:365)
        at hudson.remoting.ChannelBuilder.build(ChannelBuilder.java:310)
        at hudson.slaves.Channels.forProcess(Channels.java:115)
        at hudson.maven.AbstractMavenProcessFactory.newProcess(AbstractMavenProcessFactory.java:294)
        at hudson.maven.ProcessCache.get(ProcessCache.java:236)
        at hudson.maven.MavenModuleSetBuild$MavenModuleSetBuildExecution.doRun(MavenModuleSetBuild.java:798)
        at hudson.model.AbstractBuild$AbstractBuildExecution.run(AbstractBuild.java:534)
        at hudson.model.Run.execute(Run.java:1728)
        at hudson.maven.MavenModuleSetBuild.run(MavenModuleSetBuild.java:544)
        at hudson.model.ResourceController.execute(ResourceController.java:98)
        at hudson.model.Executor.run(Executor.java:404)

---------------------------------------------------------------------
To unsubscribe, e-mail: [hidden email]
For additional commands, e-mail: [hidden email]

Reply | Threaded
Open this post in threaded view
|

Re: Build failed in Jenkins: commons-validator #39

sebb-2-2
Seems to be a bug in Jenkins - this is before Maven is even invoked,
and Validator used to build fine with 1.6.
Raised INFRA-13556

On 21 February 2017 at 15:00, Apache Jenkins Server
<[hidden email]> wrote:

> See <https://builds.apache.org/job/commons-validator/39/display/redirect>
>
> ------------------------------------------
> Started by user sebb
> [EnvInject] - Loading node environment variables.
> Building remotely on ubuntu-1 (ubuntu) in workspace <https://builds.apache.org/job/commons-validator/ws/>
> Updating https://svn.apache.org/repos/asf/commons/proper/validator/trunk at revision '2017-02-21T15:00:12.349 +0000'
> At revision 1783899
>
> No changes for https://svn.apache.org/repos/asf/commons/proper/validator/trunk since the previous build
> Parsing POMs
> Established TCP socket on 32827
> maven32-agent.jar already up to date
> maven32-interceptor.jar already up to date
> maven3-interceptor-commons.jar already up to date
> [commons-validator] $ /home/jenkins/tools/java/latest1.6/bin/java -Xmx2g -Xms256m -cp /home/jenkins/jenkins-slave/maven32-agent.jar:/home/jenkins/tools/maven/apache-maven-3.2.5/boot/plexus-classworlds-2.5.2.jar:/home/jenkins/tools/maven/apache-maven-3.2.5/conf/logging jenkins.maven3.agent.Maven32Main /home/jenkins/tools/maven/apache-maven-3.2.5 /home/jenkins/jenkins-slave/slave.jar /home/jenkins/jenkins-slave/maven32-interceptor.jar /home/jenkins/jenkins-slave/maven3-interceptor-commons.jar 32827
> Exception in thread "main" java.lang.UnsupportedClassVersionError: hudson/remoting/Launcher : Unsupported major.minor version 51.0
>         at java.lang.ClassLoader.defineClass1(Native Method)
>         at java.lang.ClassLoader.defineClassCond(ClassLoader.java:631)
>         at java.lang.ClassLoader.defineClass(ClassLoader.java:615)
>         at java.security.SecureClassLoader.defineClass(SecureClassLoader.java:141)
>         at java.net.URLClassLoader.defineClass(URLClassLoader.java:283)
>         at java.net.URLClassLoader.access$000(URLClassLoader.java:58)
>         at java.net.URLClassLoader$1.run(URLClassLoader.java:197)
>         at java.security.AccessController.doPrivileged(Native Method)
>         at java.net.URLClassLoader.findClass(URLClassLoader.java:190)
>         at org.codehaus.plexus.classworlds.realm.ClassRealm.loadClassFromSelf(ClassRealm.java:401)
>         at org.codehaus.plexus.classworlds.strategy.SelfFirstStrategy.loadClass(SelfFirstStrategy.java:42)
>         at org.codehaus.plexus.classworlds.realm.ClassRealm.unsynchronizedLoadClass(ClassRealm.java:271)
>         at org.codehaus.plexus.classworlds.realm.ClassRealm.loadClass(ClassRealm.java:254)
>         at org.codehaus.plexus.classworlds.realm.ClassRealm.loadClass(ClassRealm.java:239)
>         at jenkins.maven3.agent.Maven32Main.main(Maven32Main.java:143)
>         at jenkins.maven3.agent.Maven32Main.main(Maven32Main.java:74)
> ERROR: Failed to parse POMs
> java.io.EOFException: unexpected stream termination
>         at hudson.remoting.ChannelBuilder.negotiate(ChannelBuilder.java:365)
>         at hudson.remoting.ChannelBuilder.build(ChannelBuilder.java:310)
>         at hudson.slaves.Channels.forProcess(Channels.java:115)
>         at hudson.maven.AbstractMavenProcessFactory.newProcess(AbstractMavenProcessFactory.java:294)
>         at hudson.maven.ProcessCache.get(ProcessCache.java:236)
>         at hudson.maven.MavenModuleSetBuild$MavenModuleSetBuildExecution.doRun(MavenModuleSetBuild.java:798)
>         at hudson.model.AbstractBuild$AbstractBuildExecution.run(AbstractBuild.java:534)
>         at hudson.model.Run.execute(Run.java:1728)
>         at hudson.maven.MavenModuleSetBuild.run(MavenModuleSetBuild.java:544)
>         at hudson.model.ResourceController.execute(ResourceController.java:98)
>         at hudson.model.Executor.run(Executor.java:404)
>
> ---------------------------------------------------------------------
> To unsubscribe, e-mail: [hidden email]
> For additional commands, e-mail: [hidden email]
>

---------------------------------------------------------------------
To unsubscribe, e-mail: [hidden email]
For additional commands, e-mail: [hidden email]

Reply | Threaded
Open this post in threaded view
|

Re: Build failed in Jenkins: commons-validator #39

Rob Tompkins-2
I actually get this error when I attempt any maven execution on my machine OS X 10.12.3 using maven 3.3.9 and:

$java -version
java version "1.6.0_65"
Java(TM) SE Runtime Environment (build 1.6.0_65-b14-468-11M4833)
Java HotSpot(TM) 64-Bit Server VM (build 20.65-b04-468, mixed mode)

It feels to me like a java-1.6/maven incompatibility.

> On Feb 21, 2017, at 10:07 AM, sebb <[hidden email]> wrote:
>
> Seems to be a bug in Jenkins - this is before Maven is even invoked,
> and Validator used to build fine with 1.6.
> Raised INFRA-13556
>
> On 21 February 2017 at 15:00, Apache Jenkins Server
> <[hidden email]> wrote:
>> See <https://builds.apache.org/job/commons-validator/39/display/redirect>
>>
>> ------------------------------------------
>> Started by user sebb
>> [EnvInject] - Loading node environment variables.
>> Building remotely on ubuntu-1 (ubuntu) in workspace <https://builds.apache.org/job/commons-validator/ws/>
>> Updating https://svn.apache.org/repos/asf/commons/proper/validator/trunk at revision '2017-02-21T15:00:12.349 +0000'
>> At revision 1783899
>>
>> No changes for https://svn.apache.org/repos/asf/commons/proper/validator/trunk since the previous build
>> Parsing POMs
>> Established TCP socket on 32827
>> maven32-agent.jar already up to date
>> maven32-interceptor.jar already up to date
>> maven3-interceptor-commons.jar already up to date
>> [commons-validator] $ /home/jenkins/tools/java/latest1.6/bin/java -Xmx2g -Xms256m -cp /home/jenkins/jenkins-slave/maven32-agent.jar:/home/jenkins/tools/maven/apache-maven-3.2.5/boot/plexus-classworlds-2.5.2.jar:/home/jenkins/tools/maven/apache-maven-3.2.5/conf/logging jenkins.maven3.agent.Maven32Main /home/jenkins/tools/maven/apache-maven-3.2.5 /home/jenkins/jenkins-slave/slave.jar /home/jenkins/jenkins-slave/maven32-interceptor.jar /home/jenkins/jenkins-slave/maven3-interceptor-commons.jar 32827
>> Exception in thread "main" java.lang.UnsupportedClassVersionError: hudson/remoting/Launcher : Unsupported major.minor version 51.0
>>        at java.lang.ClassLoader.defineClass1(Native Method)
>>        at java.lang.ClassLoader.defineClassCond(ClassLoader.java:631)
>>        at java.lang.ClassLoader.defineClass(ClassLoader.java:615)
>>        at java.security.SecureClassLoader.defineClass(SecureClassLoader.java:141)
>>        at java.net.URLClassLoader.defineClass(URLClassLoader.java:283)
>>        at java.net.URLClassLoader.access$000(URLClassLoader.java:58)
>>        at java.net.URLClassLoader$1.run(URLClassLoader.java:197)
>>        at java.security.AccessController.doPrivileged(Native Method)
>>        at java.net.URLClassLoader.findClass(URLClassLoader.java:190)
>>        at org.codehaus.plexus.classworlds.realm.ClassRealm.loadClassFromSelf(ClassRealm.java:401)
>>        at org.codehaus.plexus.classworlds.strategy.SelfFirstStrategy.loadClass(SelfFirstStrategy.java:42)
>>        at org.codehaus.plexus.classworlds.realm.ClassRealm.unsynchronizedLoadClass(ClassRealm.java:271)
>>        at org.codehaus.plexus.classworlds.realm.ClassRealm.loadClass(ClassRealm.java:254)
>>        at org.codehaus.plexus.classworlds.realm.ClassRealm.loadClass(ClassRealm.java:239)
>>        at jenkins.maven3.agent.Maven32Main.main(Maven32Main.java:143)
>>        at jenkins.maven3.agent.Maven32Main.main(Maven32Main.java:74)
>> ERROR: Failed to parse POMs
>> java.io.EOFException: unexpected stream termination
>>        at hudson.remoting.ChannelBuilder.negotiate(ChannelBuilder.java:365)
>>        at hudson.remoting.ChannelBuilder.build(ChannelBuilder.java:310)
>>        at hudson.slaves.Channels.forProcess(Channels.java:115)
>>        at hudson.maven.AbstractMavenProcessFactory.newProcess(AbstractMavenProcessFactory.java:294)
>>        at hudson.maven.ProcessCache.get(ProcessCache.java:236)
>>        at hudson.maven.MavenModuleSetBuild$MavenModuleSetBuildExecution.doRun(MavenModuleSetBuild.java:798)
>>        at hudson.model.AbstractBuild$AbstractBuildExecution.run(AbstractBuild.java:534)
>>        at hudson.model.Run.execute(Run.java:1728)
>>        at hudson.maven.MavenModuleSetBuild.run(MavenModuleSetBuild.java:544)
>>        at hudson.model.ResourceController.execute(ResourceController.java:98)
>>        at hudson.model.Executor.run(Executor.java:404)
>>
>> ---------------------------------------------------------------------
>> To unsubscribe, e-mail: [hidden email]
>> For additional commands, e-mail: [hidden email]
>>
>
> ---------------------------------------------------------------------
> To unsubscribe, e-mail: [hidden email]
> For additional commands, e-mail: [hidden email]
>


---------------------------------------------------------------------
To unsubscribe, e-mail: [hidden email]
For additional commands, e-mail: [hidden email]

Reply | Threaded
Open this post in threaded view
|

Re: Build failed in Jenkins: commons-validator #39

sebb-2-2
On 21 February 2017 at 15:20, Rob Tompkins <[hidden email]> wrote:
> I actually get this error when I attempt any maven execution on my machine OS X 10.12.3 using maven 3.3.9 and:
>
> $java -version
> java version "1.6.0_65"
> Java(TM) SE Runtime Environment (build 1.6.0_65-b14-468-11M4833)
> Java HotSpot(TM) 64-Bit Server VM (build 20.65-b04-468, mixed mode)
>
> It feels to me like a java-1.6/maven incompatibility.

Maven 3.3.9 requires Java 1.7

However that job uses Maven 2.2.5 and it used to work until a few days ago.

The failure occurs before Maven is started.

>> On Feb 21, 2017, at 10:07 AM, sebb <[hidden email]> wrote:
>>
>> Seems to be a bug in Jenkins - this is before Maven is even invoked,
>> and Validator used to build fine with 1.6.
>> Raised INFRA-13556
>>
>> On 21 February 2017 at 15:00, Apache Jenkins Server
>> <[hidden email]> wrote:
>>> See <https://builds.apache.org/job/commons-validator/39/display/redirect>
>>>
>>> ------------------------------------------
>>> Started by user sebb
>>> [EnvInject] - Loading node environment variables.
>>> Building remotely on ubuntu-1 (ubuntu) in workspace <https://builds.apache.org/job/commons-validator/ws/>
>>> Updating https://svn.apache.org/repos/asf/commons/proper/validator/trunk at revision '2017-02-21T15:00:12.349 +0000'
>>> At revision 1783899
>>>
>>> No changes for https://svn.apache.org/repos/asf/commons/proper/validator/trunk since the previous build
>>> Parsing POMs
>>> Established TCP socket on 32827
>>> maven32-agent.jar already up to date
>>> maven32-interceptor.jar already up to date
>>> maven3-interceptor-commons.jar already up to date
>>> [commons-validator] $ /home/jenkins/tools/java/latest1.6/bin/java -Xmx2g -Xms256m -cp /home/jenkins/jenkins-slave/maven32-agent.jar:/home/jenkins/tools/maven/apache-maven-3.2.5/boot/plexus-classworlds-2.5.2.jar:/home/jenkins/tools/maven/apache-maven-3.2.5/conf/logging jenkins.maven3.agent.Maven32Main /home/jenkins/tools/maven/apache-maven-3.2.5 /home/jenkins/jenkins-slave/slave.jar /home/jenkins/jenkins-slave/maven32-interceptor.jar /home/jenkins/jenkins-slave/maven3-interceptor-commons.jar 32827
>>> Exception in thread "main" java.lang.UnsupportedClassVersionError: hudson/remoting/Launcher : Unsupported major.minor version 51.0
>>>        at java.lang.ClassLoader.defineClass1(Native Method)
>>>        at java.lang.ClassLoader.defineClassCond(ClassLoader.java:631)
>>>        at java.lang.ClassLoader.defineClass(ClassLoader.java:615)
>>>        at java.security.SecureClassLoader.defineClass(SecureClassLoader.java:141)
>>>        at java.net.URLClassLoader.defineClass(URLClassLoader.java:283)
>>>        at java.net.URLClassLoader.access$000(URLClassLoader.java:58)
>>>        at java.net.URLClassLoader$1.run(URLClassLoader.java:197)
>>>        at java.security.AccessController.doPrivileged(Native Method)
>>>        at java.net.URLClassLoader.findClass(URLClassLoader.java:190)
>>>        at org.codehaus.plexus.classworlds.realm.ClassRealm.loadClassFromSelf(ClassRealm.java:401)
>>>        at org.codehaus.plexus.classworlds.strategy.SelfFirstStrategy.loadClass(SelfFirstStrategy.java:42)
>>>        at org.codehaus.plexus.classworlds.realm.ClassRealm.unsynchronizedLoadClass(ClassRealm.java:271)
>>>        at org.codehaus.plexus.classworlds.realm.ClassRealm.loadClass(ClassRealm.java:254)
>>>        at org.codehaus.plexus.classworlds.realm.ClassRealm.loadClass(ClassRealm.java:239)
>>>        at jenkins.maven3.agent.Maven32Main.main(Maven32Main.java:143)
>>>        at jenkins.maven3.agent.Maven32Main.main(Maven32Main.java:74)
>>> ERROR: Failed to parse POMs
>>> java.io.EOFException: unexpected stream termination
>>>        at hudson.remoting.ChannelBuilder.negotiate(ChannelBuilder.java:365)
>>>        at hudson.remoting.ChannelBuilder.build(ChannelBuilder.java:310)
>>>        at hudson.slaves.Channels.forProcess(Channels.java:115)
>>>        at hudson.maven.AbstractMavenProcessFactory.newProcess(AbstractMavenProcessFactory.java:294)
>>>        at hudson.maven.ProcessCache.get(ProcessCache.java:236)
>>>        at hudson.maven.MavenModuleSetBuild$MavenModuleSetBuildExecution.doRun(MavenModuleSetBuild.java:798)
>>>        at hudson.model.AbstractBuild$AbstractBuildExecution.run(AbstractBuild.java:534)
>>>        at hudson.model.Run.execute(Run.java:1728)
>>>        at hudson.maven.MavenModuleSetBuild.run(MavenModuleSetBuild.java:544)
>>>        at hudson.model.ResourceController.execute(ResourceController.java:98)
>>>        at hudson.model.Executor.run(Executor.java:404)
>>>
>>> ---------------------------------------------------------------------
>>> To unsubscribe, e-mail: [hidden email]
>>> For additional commands, e-mail: [hidden email]
>>>
>>
>> ---------------------------------------------------------------------
>> To unsubscribe, e-mail: [hidden email]
>> For additional commands, e-mail: [hidden email]
>>
>
>
> ---------------------------------------------------------------------
> To unsubscribe, e-mail: [hidden email]
> For additional commands, e-mail: [hidden email]
>

---------------------------------------------------------------------
To unsubscribe, e-mail: [hidden email]
For additional commands, e-mail: [hidden email]

Reply | Threaded
Open this post in threaded view
|

Re: Build failed in Jenkins: commons-validator #39

Rob Tompkins-2

> On Feb 21, 2017, at 10:48 AM, sebb <[hidden email]> wrote:
>
> On 21 February 2017 at 15:20, Rob Tompkins <[hidden email] <mailto:[hidden email]>> wrote:
>> I actually get this error when I attempt any maven execution on my machine OS X 10.12.3 using maven 3.3.9 and:
>>
>> $java -version
>> java version "1.6.0_65"
>> Java(TM) SE Runtime Environment (build 1.6.0_65-b14-468-11M4833)
>> Java HotSpot(TM) 64-Bit Server VM (build 20.65-b04-468, mixed mode)
>>
>> It feels to me like a java-1.6/maven incompatibility.
>
> Maven 3.3.9 requires Java 1.7
>
> However that job uses Maven 2.2.5 and it used to work until a few days ago.

It looks like it’s using Maven 3.2.5:

"/home/jenkins/tools/maven/apache-maven-3.2.5/conf/logging jenkins.maven3.agent.Maven32Main"

>
> The failure occurs before Maven is started.
>
>>> On Feb 21, 2017, at 10:07 AM, sebb <[hidden email]> wrote:
>>>
>>> Seems to be a bug in Jenkins - this is before Maven is even invoked,
>>> and Validator used to build fine with 1.6.
>>> Raised INFRA-13556
>>>
>>> On 21 February 2017 at 15:00, Apache Jenkins Server
>>> <[hidden email]> wrote:
>>>> See <https://builds.apache.org/job/commons-validator/39/display/redirect>
>>>>
>>>> ------------------------------------------
>>>> Started by user sebb
>>>> [EnvInject] - Loading node environment variables.
>>>> Building remotely on ubuntu-1 (ubuntu) in workspace <https://builds.apache.org/job/commons-validator/ws/>
>>>> Updating https://svn.apache.org/repos/asf/commons/proper/validator/trunk at revision '2017-02-21T15:00:12.349 +0000'
>>>> At revision 1783899
>>>>
>>>> No changes for https://svn.apache.org/repos/asf/commons/proper/validator/trunk since the previous build
>>>> Parsing POMs
>>>> Established TCP socket on 32827
>>>> maven32-agent.jar already up to date
>>>> maven32-interceptor.jar already up to date
>>>> maven3-interceptor-commons.jar already up to date
>>>> [commons-validator] $ /home/jenkins/tools/java/latest1.6/bin/java -Xmx2g -Xms256m -cp /home/jenkins/jenkins-slave/maven32-agent.jar:/home/jenkins/tools/maven/apache-maven-3.2.5/boot/plexus-classworlds-2.5.2.jar:/home/jenkins/tools/maven/apache-maven-3.2.5/conf/logging jenkins.maven3.agent.Maven32Main /home/jenkins/tools/maven/apache-maven-3.2.5 /home/jenkins/jenkins-slave/slave.jar /home/jenkins/jenkins-slave/maven32-interceptor.jar /home/jenkins/jenkins-slave/maven3-interceptor-commons.jar 32827
>>>> Exception in thread "main" java.lang.UnsupportedClassVersionError: hudson/remoting/Launcher : Unsupported major.minor version 51.0
>>>>       at java.lang.ClassLoader.defineClass1(Native Method)
>>>>       at java.lang.ClassLoader.defineClassCond(ClassLoader.java:631)
>>>>       at java.lang.ClassLoader.defineClass(ClassLoader.java:615)
>>>>       at java.security.SecureClassLoader.defineClass(SecureClassLoader.java:141)
>>>>       at java.net.URLClassLoader.defineClass(URLClassLoader.java:283)
>>>>       at java.net.URLClassLoader.access$000(URLClassLoader.java:58)
>>>>       at java.net.URLClassLoader$1.run(URLClassLoader.java:197)
>>>>       at java.security.AccessController.doPrivileged(Native Method)
>>>>       at java.net.URLClassLoader.findClass(URLClassLoader.java:190)
>>>>       at org.codehaus.plexus.classworlds.realm.ClassRealm.loadClassFromSelf(ClassRealm.java:401)
>>>>       at org.codehaus.plexus.classworlds.strategy.SelfFirstStrategy.loadClass(SelfFirstStrategy.java:42)
>>>>       at org.codehaus.plexus.classworlds.realm.ClassRealm.unsynchronizedLoadClass(ClassRealm.java:271)
>>>>       at org.codehaus.plexus.classworlds.realm.ClassRealm.loadClass(ClassRealm.java:254)
>>>>       at org.codehaus.plexus.classworlds.realm.ClassRealm.loadClass(ClassRealm.java:239)
>>>>       at jenkins.maven3.agent.Maven32Main.main(Maven32Main.java:143)
>>>>       at jenkins.maven3.agent.Maven32Main.main(Maven32Main.java:74)
>>>> ERROR: Failed to parse POMs
>>>> java.io.EOFException: unexpected stream termination
>>>>       at hudson.remoting.ChannelBuilder.negotiate(ChannelBuilder.java:365)
>>>>       at hudson.remoting.ChannelBuilder.build(ChannelBuilder.java:310)
>>>>       at hudson.slaves.Channels.forProcess(Channels.java:115)
>>>>       at hudson.maven.AbstractMavenProcessFactory.newProcess(AbstractMavenProcessFactory.java:294)
>>>>       at hudson.maven.ProcessCache.get(ProcessCache.java:236)
>>>>       at hudson.maven.MavenModuleSetBuild$MavenModuleSetBuildExecution.doRun(MavenModuleSetBuild.java:798)
>>>>       at hudson.model.AbstractBuild$AbstractBuildExecution.run(AbstractBuild.java:534)
>>>>       at hudson.model.Run.execute(Run.java:1728)
>>>>       at hudson.maven.MavenModuleSetBuild.run(MavenModuleSetBuild.java:544)
>>>>       at hudson.model.ResourceController.execute(ResourceController.java:98)
>>>>       at hudson.model.Executor.run(Executor.java:404)
>>>>
>>>> ---------------------------------------------------------------------
>>>> To unsubscribe, e-mail: [hidden email]
>>>> For additional commands, e-mail: [hidden email]
>>>>
>>>
>>> ---------------------------------------------------------------------
>>> To unsubscribe, e-mail: [hidden email]
>>> For additional commands, e-mail: [hidden email]
>>>
>>
>>
>> ---------------------------------------------------------------------
>> To unsubscribe, e-mail: [hidden email] <mailto:[hidden email]>
>> For additional commands, e-mail: [hidden email] <mailto:[hidden email]>
>>
>
> ---------------------------------------------------------------------
> To unsubscribe, e-mail: [hidden email] <mailto:[hidden email]>
> For additional commands, e-mail: [hidden email] <mailto:[hidden email]>
Reply | Threaded
Open this post in threaded view
|

Re: Build failed in Jenkins: commons-validator #39

sebb-2-2
On 21 February 2017 at 15:53, Rob Tompkins <[hidden email]> wrote:

>
>> On Feb 21, 2017, at 10:48 AM, sebb <[hidden email]> wrote:
>>
>> On 21 February 2017 at 15:20, Rob Tompkins <[hidden email] <mailto:[hidden email]>> wrote:
>>> I actually get this error when I attempt any maven execution on my machine OS X 10.12.3 using maven 3.3.9 and:
>>>
>>> $java -version
>>> java version "1.6.0_65"
>>> Java(TM) SE Runtime Environment (build 1.6.0_65-b14-468-11M4833)
>>> Java HotSpot(TM) 64-Bit Server VM (build 20.65-b04-468, mixed mode)
>>>
>>> It feels to me like a java-1.6/maven incompatibility.
>>
>> Maven 3.3.9 requires Java 1.7
>>
>> However that job uses Maven 2.2.5 and it used to work until a few days ago.
>
> It looks like it’s using Maven 3.2.5:
>
> "/home/jenkins/tools/maven/apache-maven-3.2.5/conf/logging jenkins.maven3.agent.Maven32Main"
>

Sorry typo, 3.2.5 is what I meant.
It still only requires Java 1.6

http://maven.apache.org/docs/history.html

>>
>> The failure occurs before Maven is started.
>>
>>>> On Feb 21, 2017, at 10:07 AM, sebb <[hidden email]> wrote:
>>>>
>>>> Seems to be a bug in Jenkins - this is before Maven is even invoked,
>>>> and Validator used to build fine with 1.6.
>>>> Raised INFRA-13556
>>>>
>>>> On 21 February 2017 at 15:00, Apache Jenkins Server
>>>> <[hidden email]> wrote:
>>>>> See <https://builds.apache.org/job/commons-validator/39/display/redirect>
>>>>>
>>>>> ------------------------------------------
>>>>> Started by user sebb
>>>>> [EnvInject] - Loading node environment variables.
>>>>> Building remotely on ubuntu-1 (ubuntu) in workspace <https://builds.apache.org/job/commons-validator/ws/>
>>>>> Updating https://svn.apache.org/repos/asf/commons/proper/validator/trunk at revision '2017-02-21T15:00:12.349 +0000'
>>>>> At revision 1783899
>>>>>
>>>>> No changes for https://svn.apache.org/repos/asf/commons/proper/validator/trunk since the previous build
>>>>> Parsing POMs
>>>>> Established TCP socket on 32827
>>>>> maven32-agent.jar already up to date
>>>>> maven32-interceptor.jar already up to date
>>>>> maven3-interceptor-commons.jar already up to date
>>>>> [commons-validator] $ /home/jenkins/tools/java/latest1.6/bin/java -Xmx2g -Xms256m -cp /home/jenkins/jenkins-slave/maven32-agent.jar:/home/jenkins/tools/maven/apache-maven-3.2.5/boot/plexus-classworlds-2.5.2.jar:/home/jenkins/tools/maven/apache-maven-3.2.5/conf/logging jenkins.maven3.agent.Maven32Main /home/jenkins/tools/maven/apache-maven-3.2.5 /home/jenkins/jenkins-slave/slave.jar /home/jenkins/jenkins-slave/maven32-interceptor.jar /home/jenkins/jenkins-slave/maven3-interceptor-commons.jar 32827
>>>>> Exception in thread "main" java.lang.UnsupportedClassVersionError: hudson/remoting/Launcher : Unsupported major.minor version 51.0
>>>>>       at java.lang.ClassLoader.defineClass1(Native Method)
>>>>>       at java.lang.ClassLoader.defineClassCond(ClassLoader.java:631)
>>>>>       at java.lang.ClassLoader.defineClass(ClassLoader.java:615)
>>>>>       at java.security.SecureClassLoader.defineClass(SecureClassLoader.java:141)
>>>>>       at java.net.URLClassLoader.defineClass(URLClassLoader.java:283)
>>>>>       at java.net.URLClassLoader.access$000(URLClassLoader.java:58)
>>>>>       at java.net.URLClassLoader$1.run(URLClassLoader.java:197)
>>>>>       at java.security.AccessController.doPrivileged(Native Method)
>>>>>       at java.net.URLClassLoader.findClass(URLClassLoader.java:190)
>>>>>       at org.codehaus.plexus.classworlds.realm.ClassRealm.loadClassFromSelf(ClassRealm.java:401)
>>>>>       at org.codehaus.plexus.classworlds.strategy.SelfFirstStrategy.loadClass(SelfFirstStrategy.java:42)
>>>>>       at org.codehaus.plexus.classworlds.realm.ClassRealm.unsynchronizedLoadClass(ClassRealm.java:271)
>>>>>       at org.codehaus.plexus.classworlds.realm.ClassRealm.loadClass(ClassRealm.java:254)
>>>>>       at org.codehaus.plexus.classworlds.realm.ClassRealm.loadClass(ClassRealm.java:239)
>>>>>       at jenkins.maven3.agent.Maven32Main.main(Maven32Main.java:143)
>>>>>       at jenkins.maven3.agent.Maven32Main.main(Maven32Main.java:74)
>>>>> ERROR: Failed to parse POMs
>>>>> java.io.EOFException: unexpected stream termination
>>>>>       at hudson.remoting.ChannelBuilder.negotiate(ChannelBuilder.java:365)
>>>>>       at hudson.remoting.ChannelBuilder.build(ChannelBuilder.java:310)
>>>>>       at hudson.slaves.Channels.forProcess(Channels.java:115)
>>>>>       at hudson.maven.AbstractMavenProcessFactory.newProcess(AbstractMavenProcessFactory.java:294)
>>>>>       at hudson.maven.ProcessCache.get(ProcessCache.java:236)
>>>>>       at hudson.maven.MavenModuleSetBuild$MavenModuleSetBuildExecution.doRun(MavenModuleSetBuild.java:798)
>>>>>       at hudson.model.AbstractBuild$AbstractBuildExecution.run(AbstractBuild.java:534)
>>>>>       at hudson.model.Run.execute(Run.java:1728)
>>>>>       at hudson.maven.MavenModuleSetBuild.run(MavenModuleSetBuild.java:544)
>>>>>       at hudson.model.ResourceController.execute(ResourceController.java:98)
>>>>>       at hudson.model.Executor.run(Executor.java:404)
>>>>>
>>>>> ---------------------------------------------------------------------
>>>>> To unsubscribe, e-mail: [hidden email]
>>>>> For additional commands, e-mail: [hidden email]
>>>>>
>>>>
>>>> ---------------------------------------------------------------------
>>>> To unsubscribe, e-mail: [hidden email]
>>>> For additional commands, e-mail: [hidden email]
>>>>
>>>
>>>
>>> ---------------------------------------------------------------------
>>> To unsubscribe, e-mail: [hidden email] <mailto:[hidden email]>
>>> For additional commands, e-mail: [hidden email] <mailto:[hidden email]>
>>>
>>
>> ---------------------------------------------------------------------
>> To unsubscribe, e-mail: [hidden email] <mailto:[hidden email]>
>> For additional commands, e-mail: [hidden email] <mailto:[hidden email]>

---------------------------------------------------------------------
To unsubscribe, e-mail: [hidden email]
For additional commands, e-mail: [hidden email]

Reply | Threaded
Open this post in threaded view
|

Re: Build failed in Jenkins: commons-validator #39

Rob Tompkins


> On Feb 21, 2017, at 11:04 AM, sebb <[hidden email]> wrote:
>
>> On 21 February 2017 at 15:53, Rob Tompkins <[hidden email]> wrote:
>>
>>> On Feb 21, 2017, at 10:48 AM, sebb <[hidden email]> wrote:
>>>
>>> On 21 February 2017 at 15:20, Rob Tompkins <[hidden email] <mailto:[hidden email]>> wrote:
>>>> I actually get this error when I attempt any maven execution on my machine OS X 10.12.3 using maven 3.3.9 and:
>>>>
>>>> $java -version
>>>> java version "1.6.0_65"
>>>> Java(TM) SE Runtime Environment (build 1.6.0_65-b14-468-11M4833)
>>>> Java HotSpot(TM) 64-Bit Server VM (build 20.65-b04-468, mixed mode)
>>>>
>>>> It feels to me like a java-1.6/maven incompatibility.
>>>
>>> Maven 3.3.9 requires Java 1.7
>>>
>>> However that job uses Maven 2.2.5 and it used to work until a few days ago.
>>
>> It looks like it’s using Maven 3.2.5:
>>
>> "/home/jenkins/tools/maven/apache-maven-3.2.5/conf/logging jenkins.maven3.agent.Maven32Main"
>>
>
> Sorry typo, 3.2.5 is what I meant.
> It still only requires Java 1.6
>
> http://maven.apache.org/docs/history.html

Fair, feels like something changed in that maven install then.

>
>>>
>>> The failure occurs before Maven is started.
>>>
>>>>> On Feb 21, 2017, at 10:07 AM, sebb <[hidden email]> wrote:
>>>>>
>>>>> Seems to be a bug in Jenkins - this is before Maven is even invoked,
>>>>> and Validator used to build fine with 1.6.
>>>>> Raised INFRA-13556
>>>>>
>>>>> On 21 February 2017 at 15:00, Apache Jenkins Server
>>>>> <[hidden email]> wrote:
>>>>>> See <https://builds.apache.org/job/commons-validator/39/display/redirect>
>>>>>>
>>>>>> ------------------------------------------
>>>>>> Started by user sebb
>>>>>> [EnvInject] - Loading node environment variables.
>>>>>> Building remotely on ubuntu-1 (ubuntu) in workspace <https://builds.apache.org/job/commons-validator/ws/>
>>>>>> Updating https://svn.apache.org/repos/asf/commons/proper/validator/trunk at revision '2017-02-21T15:00:12.349 +0000'
>>>>>> At revision 1783899
>>>>>>
>>>>>> No changes for https://svn.apache.org/repos/asf/commons/proper/validator/trunk since the previous build
>>>>>> Parsing POMs
>>>>>> Established TCP socket on 32827
>>>>>> maven32-agent.jar already up to date
>>>>>> maven32-interceptor.jar already up to date
>>>>>> maven3-interceptor-commons.jar already up to date
>>>>>> [commons-validator] $ /home/jenkins/tools/java/latest1.6/bin/java -Xmx2g -Xms256m -cp /home/jenkins/jenkins-slave/maven32-agent.jar:/home/jenkins/tools/maven/apache-maven-3.2.5/boot/plexus-classworlds-2.5.2.jar:/home/jenkins/tools/maven/apache-maven-3.2.5/conf/logging jenkins.maven3.agent.Maven32Main /home/jenkins/tools/maven/apache-maven-3.2.5 /home/jenkins/jenkins-slave/slave.jar /home/jenkins/jenkins-slave/maven32-interceptor.jar /home/jenkins/jenkins-slave/maven3-interceptor-commons.jar 32827
>>>>>> Exception in thread "main" java.lang.UnsupportedClassVersionError: hudson/remoting/Launcher : Unsupported major.minor version 51.0
>>>>>>      at java.lang.ClassLoader.defineClass1(Native Method)
>>>>>>      at java.lang.ClassLoader.defineClassCond(ClassLoader.java:631)
>>>>>>      at java.lang.ClassLoader.defineClass(ClassLoader.java:615)
>>>>>>      at java.security.SecureClassLoader.defineClass(SecureClassLoader.java:141)
>>>>>>      at java.net.URLClassLoader.defineClass(URLClassLoader.java:283)
>>>>>>      at java.net.URLClassLoader.access$000(URLClassLoader.java:58)
>>>>>>      at java.net.URLClassLoader$1.run(URLClassLoader.java:197)
>>>>>>      at java.security.AccessController.doPrivileged(Native Method)
>>>>>>      at java.net.URLClassLoader.findClass(URLClassLoader.java:190)
>>>>>>      at org.codehaus.plexus.classworlds.realm.ClassRealm.loadClassFromSelf(ClassRealm.java:401)
>>>>>>      at org.codehaus.plexus.classworlds.strategy.SelfFirstStrategy.loadClass(SelfFirstStrategy.java:42)
>>>>>>      at org.codehaus.plexus.classworlds.realm.ClassRealm.unsynchronizedLoadClass(ClassRealm.java:271)
>>>>>>      at org.codehaus.plexus.classworlds.realm.ClassRealm.loadClass(ClassRealm.java:254)
>>>>>>      at org.codehaus.plexus.classworlds.realm.ClassRealm.loadClass(ClassRealm.java:239)
>>>>>>      at jenkins.maven3.agent.Maven32Main.main(Maven32Main.java:143)
>>>>>>      at jenkins.maven3.agent.Maven32Main.main(Maven32Main.java:74)
>>>>>> ERROR: Failed to parse POMs
>>>>>> java.io.EOFException: unexpected stream termination
>>>>>>      at hudson.remoting.ChannelBuilder.negotiate(ChannelBuilder.java:365)
>>>>>>      at hudson.remoting.ChannelBuilder.build(ChannelBuilder.java:310)
>>>>>>      at hudson.slaves.Channels.forProcess(Channels.java:115)
>>>>>>      at hudson.maven.AbstractMavenProcessFactory.newProcess(AbstractMavenProcessFactory.java:294)
>>>>>>      at hudson.maven.ProcessCache.get(ProcessCache.java:236)
>>>>>>      at hudson.maven.MavenModuleSetBuild$MavenModuleSetBuildExecution.doRun(MavenModuleSetBuild.java:798)
>>>>>>      at hudson.model.AbstractBuild$AbstractBuildExecution.run(AbstractBuild.java:534)
>>>>>>      at hudson.model.Run.execute(Run.java:1728)
>>>>>>      at hudson.maven.MavenModuleSetBuild.run(MavenModuleSetBuild.java:544)
>>>>>>      at hudson.model.ResourceController.execute(ResourceController.java:98)
>>>>>>      at hudson.model.Executor.run(Executor.java:404)
>>>>>>
>>>>>> ---------------------------------------------------------------------
>>>>>> To unsubscribe, e-mail: [hidden email]
>>>>>> For additional commands, e-mail: [hidden email]
>>>>>>
>>>>>
>>>>> ---------------------------------------------------------------------
>>>>> To unsubscribe, e-mail: [hidden email]
>>>>> For additional commands, e-mail: [hidden email]
>>>>>
>>>>
>>>>
>>>> ---------------------------------------------------------------------
>>>> To unsubscribe, e-mail: [hidden email] <mailto:[hidden email]>
>>>> For additional commands, e-mail: [hidden email] <mailto:[hidden email]>
>>>>
>>>
>>> ---------------------------------------------------------------------
>>> To unsubscribe, e-mail: [hidden email] <mailto:[hidden email]>
>>> For additional commands, e-mail: [hidden email] <mailto:[hidden email]>
>
> ---------------------------------------------------------------------
> To unsubscribe, e-mail: [hidden email]
> For additional commands, e-mail: [hidden email]
>

---------------------------------------------------------------------
To unsubscribe, e-mail: [hidden email]
For additional commands, e-mail: [hidden email]

Reply | Threaded
Open this post in threaded view
|

Build failed in Jenkins: commons-validator #40

Apache Jenkins Server
In reply to this post by Apache Jenkins Server
See <https://builds.apache.org/job/commons-validator/40/display/redirect>

------------------------------------------
Started by user pono
[EnvInject] - Loading node environment variables.
ERROR: SEVERE ERROR occurs
org.jenkinsci.lib.envinject.EnvInjectException: hudson.remoting.ChannelClosedException: channel is already closed
        at org.jenkinsci.plugins.envinject.service.EnvironmentVariablesNodeLoader.gatherEnvironmentVariablesNode(EnvironmentVariablesNodeLoader.java:79)
        at org.jenkinsci.plugins.envinject.EnvInjectListener.loadEnvironmentVariablesNode(EnvInjectListener.java:80)
        at org.jenkinsci.plugins.envinject.EnvInjectListener.setUpEnvironment(EnvInjectListener.java:42)
        at hudson.model.AbstractBuild$AbstractBuildExecution.createLauncher(AbstractBuild.java:572)
        at hudson.model.AbstractBuild$AbstractBuildExecution.run(AbstractBuild.java:492)
        at hudson.model.Run.execute(Run.java:1728)
        at hudson.maven.MavenModuleSetBuild.run(MavenModuleSetBuild.java:544)
        at hudson.model.ResourceController.execute(ResourceController.java:98)
        at hudson.model.Executor.run(Executor.java:404)
Caused by: hudson.remoting.ChannelClosedException: channel is already closed
        at hudson.remoting.Channel.send(Channel.java:604)
        at hudson.remoting.Request.call(Request.java:130)
        at hudson.remoting.Channel.call(Channel.java:821)
        at hudson.FilePath.act(FilePath.java:1080)
        at org.jenkinsci.plugins.envinject.service.EnvironmentVariablesNodeLoader.gatherEnvironmentVariablesNode(EnvironmentVariablesNodeLoader.java:48)
        ... 8 more
Caused by: java.io.IOException
        at hudson.remoting.Channel.close(Channel.java:1284)
        at hudson.slaves.ChannelPinger$1.onDead(ChannelPinger.java:115)
        at hudson.remoting.PingThread.ping(PingThread.java:130)
        at hudson.remoting.PingThread.run(PingThread.java:86)
Caused by: java.util.concurrent.TimeoutException: Ping started at 1487712527382 hasn't completed by 1487712767383
        ... 2 more
[EnvInject] - [ERROR] - SEVERE ERROR occurs: channel is already closed

---------------------------------------------------------------------
To unsubscribe, e-mail: [hidden email]
For additional commands, e-mail: [hidden email]

Reply | Threaded
Open this post in threaded view
|

Build failed in Jenkins: commons-validator #41

Apache Jenkins Server
See <https://builds.apache.org/job/commons-validator/41/display/redirect>

------------------------------------------
[...truncated 3.18 KB...]
AU        src/test/java/org/apache/commons/validator/routines/PercentValidatorTest.java
AU        src/test/java/org/apache/commons/validator/routines/UrlValidatorTest.java
AU        src/test/java/org/apache/commons/validator/routines/ByteValidatorTest.java
AU        src/test/java/org/apache/commons/validator/routines/CreditCardValidatorTest.java
AU        src/test/java/org/apache/commons/validator/routines/InetAddressValidatorTest.java
AU        src/test/java/org/apache/commons/validator/routines/FloatValidatorTest.java
AU        src/test/java/org/apache/commons/validator/routines/DomainValidatorTest.java
A         src/test/java/org/apache/commons/validator/routines/checkdigit
AU        src/test/java/org/apache/commons/validator/routines/checkdigit/ISINCheckDigitTest.java
AU        src/test/java/org/apache/commons/validator/routines/checkdigit/AbstractCheckDigitTest.java
AU        src/test/java/org/apache/commons/validator/routines/checkdigit/ModulusTenABACheckDigitTest.java
AU        src/test/java/org/apache/commons/validator/routines/checkdigit/ModulusTenCUSIPCheckDigitTest.java
AU        src/test/java/org/apache/commons/validator/routines/checkdigit/VerhoeffCheckDigitTest.java
AU        src/test/java/org/apache/commons/validator/routines/checkdigit/LuhnCheckDigitTest.java
AU        src/test/java/org/apache/commons/validator/routines/checkdigit/SedolCheckDigitTest.java
AU        src/test/java/org/apache/commons/validator/routines/checkdigit/EAN13CheckDigitTest.java
AU        src/test/java/org/apache/commons/validator/routines/checkdigit/IBANCheckDigitTest.java
AU        src/test/java/org/apache/commons/validator/routines/checkdigit/ISSNCheckDigitTest.java
AU        src/test/java/org/apache/commons/validator/routines/checkdigit/CUSIPCheckDigitTest.java
AU        src/test/java/org/apache/commons/validator/routines/checkdigit/ModulusTenLuhnCheckDigitTest.java
AU        src/test/java/org/apache/commons/validator/routines/checkdigit/ModulusTenSedolCheckDigitTest.java
AU        src/test/java/org/apache/commons/validator/routines/checkdigit/ModulusTenEAN13CheckDigitTest.java
AU        src/test/java/org/apache/commons/validator/routines/checkdigit/ISBNCheckDigitTest.java
AU        src/test/java/org/apache/commons/validator/routines/checkdigit/ABANumberCheckDigitTest.java
AU        src/test/java/org/apache/commons/validator/routines/checkdigit/ISBN10CheckDigitTest.java
AU        src/test/java/org/apache/commons/validator/routines/IBANValidatorTest.java
AU        src/test/java/org/apache/commons/validator/routines/CalendarValidatorTest.java
AU        src/test/java/org/apache/commons/validator/routines/DoubleValidatorTest.java
AU        src/test/java/org/apache/commons/validator/routines/CodeValidatorTest.java
AU        src/test/java/org/apache/commons/validator/routines/RegexValidatorTest.java
AU        src/test/java/org/apache/commons/validator/routines/AbstractNumberValidatorTest.java
AU        src/test/java/org/apache/commons/validator/routines/ISSNValidatorTest.java
AU        src/test/java/org/apache/commons/validator/routines/DateValidatorTest.java
AU        src/test/java/org/apache/commons/validator/routines/BigIntegerValidatorTest.java
AU        src/test/java/org/apache/commons/validator/routines/BigDecimalValidatorTest.java
AU        src/test/java/org/apache/commons/validator/routines/EmailValidatorTest.java
AU        src/test/java/org/apache/commons/validator/routines/CurrencyValidatorTest.java
AU        src/test/java/org/apache/commons/validator/routines/ISBNValidatorTest.java
AU        src/test/java/org/apache/commons/validator/routines/IntegerValidatorTest.java
AU        src/test/java/org/apache/commons/validator/routines/AbstractCalendarValidatorTest.java
AU        src/test/java/org/apache/commons/validator/routines/TimeValidatorTest.java
AU        src/test/java/org/apache/commons/validator/routines/ShortValidatorTest.java
AU        src/test/java/org/apache/commons/validator/routines/LongValidatorTest.java
AU        src/test/java/org/apache/commons/validator/MultipleTest.java
AU        src/test/java/org/apache/commons/validator/IntegerTest.java
AU        src/test/java/org/apache/commons/validator/ExceptionTest.java
AU        src/test/java/org/apache/commons/validator/LongTest.java
AU        src/test/java/org/apache/commons/validator/ShortTest.java
AU        src/test/java/org/apache/commons/validator/UrlTest.java
AU        src/test/java/org/apache/commons/validator/ByteTest.java
AU        src/test/java/org/apache/commons/validator/FloatTest.java
AU        src/test/java/org/apache/commons/validator/GenericTypeValidatorImpl.java
AU        src/test/java/org/apache/commons/validator/NameBean.java
AU        src/test/java/org/apache/commons/validator/ValidatorResultsTest.java
AU        src/test/java/org/apache/commons/validator/DoubleTest.java
AU        src/test/java/org/apache/commons/validator/CustomValidatorResourcesTest.java
AU        src/test/java/org/apache/commons/validator/AbstractNumberTest.java
AU        src/test/java/org/apache/commons/validator/ValidatorResourcesTest.java
AU        src/test/java/org/apache/commons/validator/GenericTypeValidatorTest.java
AU        src/test/java/org/apache/commons/validator/ValidatorTest.java
AU        src/test/java/org/apache/commons/validator/EmailTest.java
AU        src/test/java/org/apache/commons/validator/VarTest.java
A         src/test/java/org/apache/commons/validator/custom
AU        src/test/java/org/apache/commons/validator/custom/CustomValidatorResources.java
AU        src/test/java/org/apache/commons/validator/ResultPair.java
A         src/test/java/org/apache/commons/validator/util
AU        src/test/java/org/apache/commons/validator/util/FlagsTest.java
A         src/test/resources
A         src/test/resources/org
A         src/test/resources/org/apache
A         src/test/resources/org/apache/commons
A         src/test/resources/org/apache/commons/validator
AU        src/test/resources/org/apache/commons/validator/RetrieveFormTest-config.xml
AU        src/test/resources/org/apache/commons/validator/ExtensionTest-config.xml
AU        src/test/resources/org/apache/commons/validator/DateTest-config.xml
AU        src/test/resources/org/apache/commons/validator/MultipleTests-config.xml
AU        src/test/resources/org/apache/commons/validator/ParameterTest-config.xml
AU        src/test/resources/org/apache/commons/validator/RequiredNameTest-config.xml
AU        src/test/resources/org/apache/commons/validator/GenericTypeValidatorTest-config.xml
AU        src/test/resources/org/apache/commons/validator/EmailTest-config.xml
AU        src/test/resources/org/apache/commons/validator/TestNumber-config.xml
AU        src/test/resources/org/apache/commons/validator/VarTest-config.xml
AU        src/test/resources/org/apache/commons/validator/EntityImportTest-byteform.xml
AU        src/test/resources/org/apache/commons/validator/ExceptionTest-config.xml
AU        src/test/resources/org/apache/commons/validator/LocaleTest-config.xml
AU        src/test/resources/org/apache/commons/validator/RequiredIfTest-config.xml
AU        src/test/resources/org/apache/commons/validator/MultipleConfigFilesTest-1-config.xml
AU        src/test/resources/org/apache/commons/validator/MultipleConfigFilesTest-2-config.xml
A         src/test/resources/org/apache/commons/validator/routines
A         src/test/resources/org/apache/commons/validator/routines/checkdigit
AU        src/test/resources/org/apache/commons/validator/routines/checkdigit/IBANtests.txt
AU        src/test/resources/org/apache/commons/validator/ValidatorResultsTest-config.xml
AU        src/test/resources/org/apache/commons/validator/EntityImportTest-config.xml
A         src/main
A         src/main/java
A         src/main/java/org
A         src/main/java/org/apache
A         src/main/java/org/apache/commons
A         src/main/java/org/apache/commons/validator
AU        src/main/java/org/apache/commons/validator/ISBNValidator.java
AU        src/main/java/org/apache/commons/validator/Form.java
AU        src/main/java/org/apache/commons/validator/ValidatorException.java
AU        src/main/java/org/apache/commons/validator/ValidatorResults.java
AU        src/main/java/org/apache/commons/validator/FormSetFactory.java
AU        src/main/java/org/apache/commons/validator/UrlValidator.java
AU        src/main/java/org/apache/commons/validator/Arg.java
AU        src/main/java/org/apache/commons/validator/CreditCardValidator.java
AU        src/main/java/org/apache/commons/validator/package.html
AU        src/main/java/org/apache/commons/validator/FormSet.java
AU        src/main/java/org/apache/commons/validator/ValidatorResources.java
AU        src/main/java/org/apache/commons/validator/GenericValidator.java
AU        src/main/java/org/apache/commons/validator/ValidatorAction.java
AU        src/main/java/org/apache/commons/validator/Field.java
AU        src/main/java/org/apache/commons/validator/DateValidator.java
AU        src/main/java/org/apache/commons/validator/GenericTypeValidator.java
AU        src/main/java/org/apache/commons/validator/ValidatorResult.java
AU        src/main/java/org/apache/commons/validator/Validator.java
AU        src/main/java/org/apache/commons/validator/Msg.java
A         src/main/java/org/apache/commons/validator/routines
AU        src/main/java/org/apache/commons/validator/routines/BigIntegerValidator.java
AU        src/main/java/org/apache/commons/validator/routines/BigDecimalValidator.java
AU        src/main/java/org/apache/commons/validator/routines/EmailValidator.java
AU        src/main/java/org/apache/commons/validator/routines/CurrencyValidator.java
AU        src/main/java/org/apache/commons/validator/routines/ISBNValidator.java
AU        src/main/java/org/apache/commons/validator/routines/IntegerValidator.java
AU        src/main/java/org/apache/commons/validator/routines/AbstractCalendarValidator.java
AU        src/main/java/org/apache/commons/validator/routines/TimeValidator.java
AU        src/main/java/org/apache/commons/validator/routines/ShortValidator.java
AU        src/main/java/org/apache/commons/validator/routines/LongValidator.java
AU        src/main/java/org/apache/commons/validator/routines/PercentValidator.java
AU        src/main/java/org/apache/commons/validator/routines/UrlValidator.java
AU        src/main/java/org/apache/commons/validator/routines/ByteValidator.java
AU        src/main/java/org/apache/commons/validator/routines/CreditCardValidator.java
AU        src/main/java/org/apache/commons/validator/routines/InetAddressValidator.java
AU        src/main/java/org/apache/commons/validator/routines/FloatValidator.java
AU        src/main/java/org/apache/commons/validator/routines/DomainValidator.java
AU        src/main/java/org/apache/commons/validator/routines/package.html
A         src/main/java/org/apache/commons/validator/routines/checkdigit
AU        src/main/java/org/apache/commons/validator/routines/checkdigit/IBANCheckDigit.java
AU        src/main/java/org/apache/commons/validator/routines/checkdigit/ISSNCheckDigit.java
AU        src/main/java/org/apache/commons/validator/routines/checkdigit/CheckDigit.java
AU        src/main/java/org/apache/commons/validator/routines/checkdigit/CUSIPCheckDigit.java
AU        src/main/java/org/apache/commons/validator/routines/checkdigit/ModulusCheckDigit.java
AU        src/main/java/org/apache/commons/validator/routines/checkdigit/ISBNCheckDigit.java
AU        src/main/java/org/apache/commons/validator/routines/checkdigit/ABANumberCheckDigit.java
AU        src/main/java/org/apache/commons/validator/routines/checkdigit/ISBN10CheckDigit.java
AU        src/main/java/org/apache/commons/validator/routines/checkdigit/CheckDigitException.java
A         src/main/java/org/apache/commons/validator/routines/checkdigit/ModulusTenCheckDigit.java
AU        src/main/java/org/apache/commons/validator/routines/checkdigit/package.html
AU        src/main/java/org/apache/commons/validator/routines/checkdigit/ISINCheckDigit.java
AU        src/main/java/org/apache/commons/validator/routines/checkdigit/VerhoeffCheckDigit.java
AU        src/main/java/org/apache/commons/validator/routines/checkdigit/LuhnCheckDigit.java
AU        src/main/java/org/apache/commons/validator/routines/checkdigit/SedolCheckDigit.java
AU        src/main/java/org/apache/commons/validator/routines/checkdigit/EAN13CheckDigit.java
AU        src/main/java/org/apache/commons/validator/routines/IBANValidator.java
AU        src/main/java/org/apache/commons/validator/routines/CalendarValidator.java
AU        src/main/java/org/apache/commons/validator/routines/DoubleValidator.java
AU        src/main/java/org/apache/commons/validator/routines/CodeValidator.java
AU        src/main/java/org/apache/commons/validator/routines/RegexValidator.java
AU        src/main/java/org/apache/commons/validator/routines/AbstractNumberValidator.java
AU        src/main/java/org/apache/commons/validator/routines/AbstractFormatValidator.java
AU        src/main/java/org/apache/commons/validator/routines/ISSNValidator.java
AU        src/main/java/org/apache/commons/validator/routines/DateValidator.java
AU        src/main/java/org/apache/commons/validator/Var.java
A         src/main/java/org/apache/commons/validator/util
AU        src/main/java/org/apache/commons/validator/util/ValidatorUtils.java
AU        src/main/java/org/apache/commons/validator/util/Flags.java
AU        src/main/java/org/apache/commons/validator/util/package.html
AU        src/main/java/org/apache/commons/validator/EmailValidator.java
A         src/main/resources
A         src/main/resources/org
A         src/main/resources/org/apache
A         src/main/resources/org/apache/commons
A         src/main/resources/org/apache/commons/validator
A         src/main/resources/org/apache/commons/validator/resources
AU        src/main/resources/org/apache/commons/validator/resources/validator_1_0.dtd
AU        src/main/resources/org/apache/commons/validator/resources/validator_1_0_1.dtd
AU        src/main/resources/org/apache/commons/validator/resources/validator_1_1.dtd
AU        src/main/resources/org/apache/commons/validator/resources/validator_1_2_0.dtd
AU        src/main/resources/org/apache/commons/validator/resources/validator_1_3_0.dtd
AU        src/main/resources/org/apache/commons/validator/resources/validator_1_1_3.dtd
AU        src/main/resources/org/apache/commons/validator/resources/validator_1_4_0.dtd
AU        src/main/resources/org/apache/commons/validator/digester-rules.xml
A         src/site
A         src/site/resources
A         src/site/resources/images
AU        src/site/resources/images/logo.png
AU        src/site/resources/download_validator.cgi
A         src/site/xdoc
AU        src/site/xdoc/community.xml
AU        src/site/xdoc/tasks.xml
AU        src/site/xdoc/index.xml
AU        src/site/xdoc/issue-tracking.xml
AU        src/site/xdoc/download_validator.xml
AU        src/site/xdoc/building.xml
AU        src/site/xdoc/mail-lists.xml
AU        src/site/xdoc/validator_2_0_0_proposal.dtd
AU        src/site/site.xml
A         src/javascript
A         src/changes
AU        src/changes/changes.xml
AU        src/changes/release-notes.vm
AU        checkstyle-suppressions.xml
AU        pom.xml
AU        BUILDING.txt
AU        README.md
AU        checkstyle.xml
AU        NOTICE.txt
AU        LICENSE.txt
AU        PROPOSAL.html
 U        .
At revision 1784009

Parsing POMs
Established TCP socket on 46113
maven32-agent.jar already up to date
maven32-interceptor.jar already up to date
maven3-interceptor-commons.jar already up to date
[commons-validator] $ /home/jenkins/tools/java/latest1.6/bin/java -Xmx2g -Xms256m -cp /home/jenkins/jenkins-slave/maven32-agent.jar:/home/jenkins/tools/maven/apache-maven-3.2.5/boot/plexus-classworlds-2.5.2.jar:/home/jenkins/tools/maven/apache-maven-3.2.5/conf/logging jenkins.maven3.agent.Maven32Main /home/jenkins/tools/maven/apache-maven-3.2.5 /home/jenkins/jenkins-slave/slave.jar /home/jenkins/jenkins-slave/maven32-interceptor.jar /home/jenkins/jenkins-slave/maven3-interceptor-commons.jar 46113
Exception in thread "main" java.lang.UnsupportedClassVersionError: hudson/remoting/Launcher : Unsupported major.minor version 51.0
        at java.lang.ClassLoader.defineClass1(Native Method)
        at java.lang.ClassLoader.defineClassCond(ClassLoader.java:631)
        at java.lang.ClassLoader.defineClass(ClassLoader.java:615)
        at java.security.SecureClassLoader.defineClass(SecureClassLoader.java:141)
        at java.net.URLClassLoader.defineClass(URLClassLoader.java:283)
        at java.net.URLClassLoader.access$000(URLClassLoader.java:58)
        at java.net.URLClassLoader$1.run(URLClassLoader.java:197)
        at java.security.AccessController.doPrivileged(Native Method)
        at java.net.URLClassLoader.findClass(URLClassLoader.java:190)
        at org.codehaus.plexus.classworlds.realm.ClassRealm.loadClassFromSelf(ClassRealm.java:401)
        at org.codehaus.plexus.classworlds.strategy.SelfFirstStrategy.loadClass(SelfFirstStrategy.java:42)
        at org.codehaus.plexus.classworlds.realm.ClassRealm.unsynchronizedLoadClass(ClassRealm.java:271)
        at org.codehaus.plexus.classworlds.realm.ClassRealm.loadClass(ClassRealm.java:254)
        at org.codehaus.plexus.classworlds.realm.ClassRealm.loadClass(ClassRealm.java:239)
        at jenkins.maven3.agent.Maven32Main.main(Maven32Main.java:143)
        at jenkins.maven3.agent.Maven32Main.main(Maven32Main.java:74)
ERROR: Failed to parse POMs
java.io.EOFException: unexpected stream termination
        at hudson.remoting.ChannelBuilder.negotiate(ChannelBuilder.java:365)
        at hudson.remoting.ChannelBuilder.build(ChannelBuilder.java:310)
        at hudson.slaves.Channels.forProcess(Channels.java:115)
        at hudson.maven.AbstractMavenProcessFactory.newProcess(AbstractMavenProcessFactory.java:294)
        at hudson.maven.ProcessCache.get(ProcessCache.java:236)
        at hudson.maven.MavenModuleSetBuild$MavenModuleSetBuildExecution.doRun(MavenModuleSetBuild.java:798)
        at hudson.model.AbstractBuild$AbstractBuildExecution.run(AbstractBuild.java:534)
        at hudson.model.Run.execute(Run.java:1728)
        at hudson.maven.MavenModuleSetBuild.run(MavenModuleSetBuild.java:544)
        at hudson.model.ResourceController.execute(ResourceController.java:98)
        at hudson.model.Executor.run(Executor.java:404)

---------------------------------------------------------------------
To unsubscribe, e-mail: [hidden email]
For additional commands, e-mail: [hidden email]