Fwd: Build failed in Jenkins: commons-csv #88

classic Classic list List threaded Threaded
4 messages Options
Reply | Threaded
Open this post in threaded view
|

Fwd: Build failed in Jenkins: commons-csv #88

Benedikt Ritter-4
These failures don't seem to be related to my changes. Any idea how to fix
this?

---------- Forwarded message ---------
From: Apache Jenkins Server <[hidden email]>
Date: Mo., 20. Aug. 2018 um 08:50 Uhr
Subject: Build failed in Jenkins: commons-csv #88
To: <[hidden email]>


See <
https://builds.apache.org/job/commons-csv/88/display/redirect?page=changes>

Changes:

[britter] Add missing predefined formats to class documentation

------------------------------------------
[...truncated 155.25 KB...]
[INFO] Downloaded from central:
https://repo.maven.apache.org/maven2/org/apache/httpcomponents/httpcore/4.4.4/httpcore-4.4.4.pom
(5.5 kB at 240 kB/s)
[INFO] Downloading from central:
https://repo.maven.apache.org/maven2/org/apache/httpcomponents/httpcomponents-core/4.4.4/httpcomponents-core-4.4.4.pom
[INFO] Downloaded from central:
https://repo.maven.apache.org/maven2/org/apache/httpcomponents/httpcomponents-core/4.4.4/httpcomponents-core-4.4.4.pom
(13 kB at 537 kB/s)
[INFO] Downloading from central:
https://repo.maven.apache.org/maven2/commons-codec/commons-codec/1.9/commons-codec-1.9.pom
[INFO] Downloaded from central:
https://repo.maven.apache.org/maven2/commons-codec/commons-codec/1.9/commons-codec-1.9.pom
(12 kB at 481 kB/s)
[INFO] Downloading from central:
https://repo.maven.apache.org/maven2/org/apache/commons/commons-parent/32/commons-parent-32.pom
[INFO] Downloaded from central:
https://repo.maven.apache.org/maven2/org/apache/commons/commons-parent/32/commons-parent-32.pom
(53 kB at 2.1 MB/s)
[INFO] Downloading from central:
https://repo.maven.apache.org/maven2/org/codehaus/plexus/plexus-java/0.9.5/plexus-java-0.9.5.pom
[INFO] Downloaded from central:
https://repo.maven.apache.org/maven2/org/codehaus/plexus/plexus-java/0.9.5/plexus-java-0.9.5.pom
(2.4 kB at 97 kB/s)
[INFO] Downloading from central:
https://repo.maven.apache.org/maven2/org/codehaus/plexus/plexus-languages/0.9.5/plexus-languages-0.9.5.pom
[INFO] Downloaded from central:
https://repo.maven.apache.org/maven2/org/codehaus/plexus/plexus-languages/0.9.5/plexus-languages-0.9.5.pom
(2.3 kB at 95 kB/s)
[INFO] Downloading from central:
https://repo.maven.apache.org/maven2/org/ow2/asm/asm/6.0/asm-6.0.pom
[INFO] Downloaded from central:
https://repo.maven.apache.org/maven2/org/ow2/asm/asm/6.0/asm-6.0.pom (1.9
kB at 84 kB/s)
[INFO] Downloading from central:
https://repo.maven.apache.org/maven2/org/ow2/asm/asm-parent/6.0/asm-parent-6.0.pom
[INFO] Downloaded from central:
https://repo.maven.apache.org/maven2/org/ow2/asm/asm-parent/6.0/asm-parent-6.0.pom
(5.5 kB at 229 kB/s)
[INFO] Downloading from central:
https://repo.maven.apache.org/maven2/org/codehaus/plexus/plexus-container-default/1.0-alpha-7/plexus-container-default-1.0-alpha-7.pom
[INFO] Downloaded from central:
https://repo.maven.apache.org/maven2/org/codehaus/plexus/plexus-container-default/1.0-alpha-7/plexus-container-default-1.0-alpha-7.pom
(1.3 kB at 56 kB/s)
[INFO] Downloading from central:
https://repo.maven.apache.org/maven2/plexus/plexus-containers/1.0.2/plexus-containers-1.0.2.pom
[INFO] Downloaded from central:
https://repo.maven.apache.org/maven2/plexus/plexus-containers/1.0.2/plexus-containers-1.0.2.pom
(471 B at 20 kB/s)
[INFO] Downloading from central:
https://repo.maven.apache.org/maven2/plexus/plexus-root/1.0.3/plexus-root-1.0.3.pom
[INFO] Downloaded from central:
https://repo.maven.apache.org/maven2/plexus/plexus-root/1.0.3/plexus-root-1.0.3.pom
(6.0 kB at 262 kB/s)
[INFO] Downloading from central:
https://repo.maven.apache.org/maven2/org/apache/maven/shared/maven-shared-utils/3.0.1/maven-shared-utils-3.0.1.jar
[INFO] Downloading from central:
https://repo.maven.apache.org/maven2/org/apache/maven/shared/maven-invoker/2.2/maven-invoker-2.2.jar
[INFO] Downloading from central:
https://repo.maven.apache.org/maven2/org/apache/maven/shared/maven-common-artifact-filters/3.0.0/maven-common-artifact-filters-3.0.0.jar
[INFO] Downloading from central:
https://repo.maven.apache.org/maven2/org/apache/maven/shared/maven-artifact-transfer/0.9.1/maven-artifact-transfer-0.9.1.jar
[INFO] Downloading from central:
https://repo.maven.apache.org/maven2/org/slf4j/slf4j-api/1.7.5/slf4j-api-1.7.5.jar
[INFO] Downloaded from central:
https://repo.maven.apache.org/maven2/org/apache/maven/shared/maven-invoker/2.2/maven-invoker-2.2.jar
(30 kB at 1.1 MB/s)
[INFO] Downloading from central:
https://repo.maven.apache.org/maven2/org/apache/maven/doxia/doxia-sink-api/1.7/doxia-sink-api-1.7.jar
[INFO] Downloaded from central:
https://repo.maven.apache.org/maven2/org/apache/maven/shared/maven-shared-utils/3.0.1/maven-shared-utils-3.0.1.jar
(154 kB at 5.1 MB/s)
[INFO] Downloading from central:
https://repo.maven.apache.org/maven2/org/apache/maven/doxia/doxia-logging-api/1.7/doxia-logging-api-1.7.jar
[INFO] Downloaded from central:
https://repo.maven.apache.org/maven2/org/apache/maven/shared/maven-artifact-transfer/0.9.1/maven-artifact-transfer-0.9.1.jar
(123 kB at 4.1 MB/s)
[INFO] Downloading from central:
https://repo.maven.apache.org/maven2/org/apache/maven/doxia/doxia-site-renderer/1.7.4/doxia-site-renderer-1.7.4.jar
[INFO] Downloaded from central:
https://repo.maven.apache.org/maven2/org/slf4j/slf4j-api/1.7.5/slf4j-api-1.7.5.jar
(26 kB at 869 kB/s)
[INFO] Downloaded from central:
https://repo.maven.apache.org/maven2/org/apache/maven/shared/maven-common-artifact-filters/3.0.0/maven-common-artifact-filters-3.0.0.jar
(57 kB at 1.8 MB/s)
[INFO] Downloading from central:
https://repo.maven.apache.org/maven2/org/apache/maven/doxia/doxia-core/1.7/doxia-core-1.7.jar
[INFO] Downloading from central:
https://repo.maven.apache.org/maven2/xmlunit/xmlunit/1.5/xmlunit-1.5.jar
[INFO] Downloaded from central:
https://repo.maven.apache.org/maven2/org/apache/maven/doxia/doxia-sink-api/1.7/doxia-sink-api-1.7.jar
(11 kB at 233 kB/s)
[INFO] Downloading from central:
https://repo.maven.apache.org/maven2/org/apache/maven/doxia/doxia-decoration-model/1.7.4/doxia-decoration-model-1.7.4.jar
[INFO] Downloaded from central:
https://repo.maven.apache.org/maven2/org/apache/maven/doxia/doxia-logging-api/1.7/doxia-logging-api-1.7.jar
(12 kB at 227 kB/s)
[INFO] Downloading from central:
https://repo.maven.apache.org/maven2/org/apache/maven/doxia/doxia-skin-model/1.7.4/doxia-skin-model-1.7.4.jar
[INFO] Downloaded from central:
https://repo.maven.apache.org/maven2/org/apache/maven/doxia/doxia-site-renderer/1.7.4/doxia-site-renderer-1.7.4.jar
(64 kB at 1.2 MB/s)
[INFO] Downloading from central:
https://repo.maven.apache.org/maven2/org/apache/maven/doxia/doxia-module-xhtml/1.7/doxia-module-xhtml-1.7.jar
[INFO] Downloaded from central:
https://repo.maven.apache.org/maven2/xmlunit/xmlunit/1.5/xmlunit-1.5.jar
(98 kB at 1.8 MB/s)
[INFO] Downloading from central:
https://repo.maven.apache.org/maven2/org/apache/commons/commons-lang3/3.5/commons-lang3-3.5.jar
[INFO] Downloaded from central:
https://repo.maven.apache.org/maven2/org/apache/maven/doxia/doxia-core/1.7/doxia-core-1.7.jar
(167 kB at 2.9 MB/s)
[INFO] Downloading from central:
https://repo.maven.apache.org/maven2/org/apache/httpcomponents/httpclient/4.5.2/httpclient-4.5.2.jar
[INFO] Downloaded from central:
https://repo.maven.apache.org/maven2/org/apache/maven/doxia/doxia-decoration-model/1.7.4/doxia-decoration-model-1.7.4.jar
(61 kB at 819 kB/s)
[INFO] Downloaded from central:
https://repo.maven.apache.org/maven2/org/apache/maven/doxia/doxia-skin-model/1.7.4/doxia-skin-model-1.7.4.jar
(16 kB at 213 kB/s)
[INFO] Downloading from central:
https://repo.maven.apache.org/maven2/org/apache/httpcomponents/httpcore/4.4.4/httpcore-4.4.4.jar
[INFO] Downloading from central:
https://repo.maven.apache.org/maven2/commons-logging/commons-logging/1.2/commons-logging-1.2.jar
[INFO] Downloaded from central:
https://repo.maven.apache.org/maven2/org/apache/maven/doxia/doxia-module-xhtml/1.7/doxia-module-xhtml-1.7.jar
(17 kB at 224 kB/s)
[INFO] Downloading from central:
https://repo.maven.apache.org/maven2/org/codehaus/plexus/plexus-java/0.9.5/plexus-java-0.9.5.jar
[INFO] Downloaded from central:
https://repo.maven.apache.org/maven2/org/apache/commons/commons-lang3/3.5/commons-lang3-3.5.jar
(480 kB at 5.1 MB/s)
[INFO] Downloading from central:
https://repo.maven.apache.org/maven2/org/ow2/asm/asm/6.0/asm-6.0.jar
[INFO] Downloaded from central:
https://repo.maven.apache.org/maven2/commons-logging/commons-logging/1.2/commons-logging-1.2.jar
(62 kB at 606 kB/s)
[INFO] Downloaded from central:
https://repo.maven.apache.org/maven2/org/codehaus/plexus/plexus-java/0.9.5/plexus-java-0.9.5.jar
(32 kB at 312 kB/s)
[INFO] Downloaded from central:
https://repo.maven.apache.org/maven2/org/apache/httpcomponents/httpclient/4.5.2/httpclient-4.5.2.jar
(737 kB at 7.0 MB/s)
[INFO] Downloaded from central:
https://repo.maven.apache.org/maven2/org/apache/httpcomponents/httpcore/4.4.4/httpcore-4.4.4.jar
(327 kB at 3.0 MB/s)
[INFO] Downloaded from central:
https://repo.maven.apache.org/maven2/org/ow2/asm/asm/6.0/asm-6.0.jar (95 kB
at 787 kB/s)
[JENKINS] Archiving  javadoc
[WARNING] Attempt to (de-)serialize anonymous class hudson.FilePath$32;
see: https://jenkins.io/redirect/serialization-of-anonymous-classes/
[INFO]
[INFO] --- maven-javadoc-plugin:3.0.0:jar (create-javadoc-jar) @
commons-csv ---
[INFO] Building jar: <
https://builds.apache.org/job/commons-csv/ws/target/commons-csv-1.6-SNAPSHOT-javadoc.jar
>
[INFO]
[INFO] >>> maven-source-plugin:3.0.1:jar (create-source-jar) >
generate-sources @ commons-csv >>>
[INFO]
[INFO] --- maven-enforcer-plugin:1.4.1:enforce (enforce-maven-3) @
commons-csv ---
[INFO]
[INFO] --- build-helper-maven-plugin:3.0.0:parse-version (parse-version) @
commons-csv ---
[INFO]
[INFO] --- maven-antrun-plugin:1.8:run (javadoc.resources) @ commons-csv ---
[INFO] Executing tasks

main:
[INFO] Executed tasks
[WARNING] Failed to getClass for
org.apache.maven.plugins.source.SourceJarMojo
[INFO]
[INFO] <<< maven-source-plugin:3.0.1:jar (create-source-jar) <
generate-sources @ commons-csv <<<
[INFO]
[INFO]
[INFO] --- maven-source-plugin:3.0.1:jar (create-source-jar) @ commons-csv
---
[INFO] Building jar: <
https://builds.apache.org/job/commons-csv/ws/target/commons-csv-1.6-SNAPSHOT-sources.jar
>
[INFO]
[INFO] >>> maven-source-plugin:3.0.1:test-jar (create-source-jar) >
generate-sources @ commons-csv >>>
[INFO]
[INFO] --- maven-enforcer-plugin:1.4.1:enforce (enforce-maven-3) @
commons-csv ---
[INFO]
[INFO] --- build-helper-maven-plugin:3.0.0:parse-version (parse-version) @
commons-csv ---
[INFO]
[INFO] --- maven-antrun-plugin:1.8:run (javadoc.resources) @ commons-csv ---
[INFO] Executing tasks

main:
[INFO] Executed tasks
[WARNING] Failed to getClass for
org.apache.maven.plugins.source.TestSourceJarMojo
[INFO]
[INFO] <<< maven-source-plugin:3.0.1:test-jar (create-source-jar) <
generate-sources @ commons-csv <<<
[INFO]
[INFO]
[INFO] --- maven-source-plugin:3.0.1:test-jar (create-source-jar) @
commons-csv ---
[INFO] Building jar: <
https://builds.apache.org/job/commons-csv/ws/target/commons-csv-1.6-SNAPSHOT-test-sources.jar
>
[INFO]
[INFO] --- maven-jar-plugin:3.0.0:test-jar (default) @ commons-csv ---
[INFO] Building jar: <
https://builds.apache.org/job/commons-csv/ws/target/commons-csv-1.6-SNAPSHOT-tests.jar
>
[INFO]
[INFO] --- maven-assembly-plugin:2.6:single (default) @ commons-csv ---
[INFO] Downloading from central:
https://repo.maven.apache.org/maven2/org/codehaus/plexus/plexus-archiver/3.0.1/plexus-archiver-3.0.1.pom
[INFO] Downloaded from central:
https://repo.maven.apache.org/maven2/org/codehaus/plexus/plexus-archiver/3.0.1/plexus-archiver-3.0.1.pom
(5.8 kB at 214 kB/s)
[INFO] Downloading from central:
https://repo.maven.apache.org/maven2/org/codehaus/plexus/plexus-io/2.6/plexus-io-2.6.pom
[INFO] Downloaded from central:
https://repo.maven.apache.org/maven2/org/codehaus/plexus/plexus-io/2.6/plexus-io-2.6.pom
(3.9 kB at 164 kB/s)
[INFO] Downloading from central:
https://repo.maven.apache.org/maven2/org/iq80/snappy/snappy/0.3/snappy-0.3.pom
[INFO] Downloaded from central:
https://repo.maven.apache.org/maven2/org/iq80/snappy/snappy/0.3/snappy-0.3.pom
(14 kB at 600 kB/s)
[INFO] Downloading from central:
https://repo.maven.apache.org/maven2/org/apache/maven/shared/file-management/1.1/file-management-1.1.pom
[INFO] Downloaded from central:
https://repo.maven.apache.org/maven2/org/apache/maven/shared/file-management/1.1/file-management-1.1.pom
(2.7 kB at 111 kB/s)
[INFO] Downloading from central:
https://repo.maven.apache.org/maven2/org/apache/maven/shared/maven-shared-components/4/maven-shared-components-4.pom
[INFO] Downloaded from central:
https://repo.maven.apache.org/maven2/org/apache/maven/shared/maven-shared-components/4/maven-shared-components-4.pom
(2.2 kB at 92 kB/s)
[INFO] Downloading from central:
https://repo.maven.apache.org/maven2/org/apache/maven/shared/maven-shared-io/1.0/maven-shared-io-1.0.pom
[INFO] Downloaded from central:
https://repo.maven.apache.org/maven2/org/apache/maven/shared/maven-shared-io/1.0/maven-shared-io-1.0.pom
(3.0 kB at 126 kB/s)
[INFO] Downloading from central:
https://repo.maven.apache.org/maven2/org/apache/maven/shared/maven-filtering/1.3/maven-filtering-1.3.pom
[INFO] Downloaded from central:
https://repo.maven.apache.org/maven2/org/apache/maven/shared/maven-filtering/1.3/maven-filtering-1.3.pom
(6.2 kB at 258 kB/s)
[INFO] Downloading from central:
https://repo.maven.apache.org/maven2/org/codehaus/plexus/plexus-utils/3.0.18/plexus-utils-3.0.18.pom
[INFO] Downloaded from central:
https://repo.maven.apache.org/maven2/org/codehaus/plexus/plexus-utils/3.0.18/plexus-utils-3.0.18.pom
(3.4 kB at 141 kB/s)
[INFO] Downloading from central:
https://repo.maven.apache.org/maven2/org/apache/maven/shared/maven-repository-builder/1.0/maven-repository-builder-1.0.pom
[INFO] Downloaded from central:
https://repo.maven.apache.org/maven2/org/apache/maven/shared/maven-repository-builder/1.0/maven-repository-builder-1.0.pom
(4.6 kB at 190 kB/s)
[INFO] Downloading from central:
https://repo.maven.apache.org/maven2/org/apache/maven/maven-artifact/2.0.4/maven-artifact-2.0.4.pom
[INFO] Downloaded from central:
https://repo.maven.apache.org/maven2/org/apache/maven/maven-artifact/2.0.4/maven-artifact-2.0.4.pom
(765 B at 33 kB/s)
[INFO] Downloading from central:
https://repo.maven.apache.org/maven2/org/apache/maven/maven/2.0.4/maven-2.0.4.pom
[INFO] Downloaded from central:
https://repo.maven.apache.org/maven2/org/apache/maven/maven/2.0.4/maven-2.0.4.pom
(12 kB at 491 kB/s)
[INFO] Downloading from central:
https://repo.maven.apache.org/maven2/org/apache/maven/maven-artifact-manager/2.0.4/maven-artifact-manager-2.0.4.pom
[INFO] Downloaded from central:
https://repo.maven.apache.org/maven2/org/apache/maven/maven-artifact-manager/2.0.4/maven-artifact-manager-2.0.4.pom
(1.4 kB at 59 kB/s)
[INFO] Downloading from central:
https://repo.maven.apache.org/maven2/org/apache/maven/maven-repository-metadata/2.0.4/maven-repository-metadata-2.0.4.pom
[INFO] Downloaded from central:
https://repo.maven.apache.org/maven2/org/apache/maven/maven-repository-metadata/2.0.4/maven-repository-metadata-2.0.4.pom
(1.5 kB at 65 kB/s)
[INFO] Downloading from central:
https://repo.maven.apache.org/maven2/org/apache/maven/maven-project/2.0.4/maven-project-2.0.4.pom
[INFO] Downloaded from central:
https://repo.maven.apache.org/maven2/org/apache/maven/maven-project/2.0.4/maven-project-2.0.4.pom
(1.8 kB at 77 kB/s)
[INFO] Downloading from central:
https://repo.maven.apache.org/maven2/org/apache/maven/maven-settings/2.0.4/maven-settings-2.0.4.pom
[INFO] Downloaded from central:
https://repo.maven.apache.org/maven2/org/apache/maven/maven-settings/2.0.4/maven-settings-2.0.4.pom
(1.6 kB at 71 kB/s)
[INFO] Downloading from central:
https://repo.maven.apache.org/maven2/org/apache/maven/maven-model/2.0.4/maven-model-2.0.4.pom
[INFO] Downloaded from central:
https://repo.maven.apache.org/maven2/org/apache/maven/maven-model/2.0.4/maven-model-2.0.4.pom
(2.7 kB at 118 kB/s)
[INFO] Downloading from central:
https://repo.maven.apache.org/maven2/org/apache/maven/maven-profile/2.0.4/maven-profile-2.0.4.pom
[INFO] Downloaded from central:
https://repo.maven.apache.org/maven2/org/apache/maven/maven-profile/2.0.4/maven-profile-2.0.4.pom
(1.6 kB at 70 kB/s)
[INFO] Downloading from central:
https://repo.maven.apache.org/maven2/org/codehaus/plexus/plexus-interpolation/1.22/plexus-interpolation-1.22.jar
[INFO] Downloading from central:
https://repo.maven.apache.org/maven2/org/codehaus/plexus/plexus-archiver/3.0.1/plexus-archiver-3.0.1.jar
[INFO] Downloading from central:
https://repo.maven.apache.org/maven2/org/iq80/snappy/snappy/0.3/snappy-0.3.jar
[INFO] Downloading from central:
https://repo.maven.apache.org/maven2/org/apache/maven/shared/file-management/1.1/file-management-1.1.jar
[INFO] Downloading from central:
https://repo.maven.apache.org/maven2/org/apache/maven/shared/maven-filtering/1.3/maven-filtering-1.3.jar
[INFO] Downloaded from central:
https://repo.maven.apache.org/maven2/org/codehaus/plexus/plexus-interpolation/1.22/plexus-interpolation-1.22.jar
(77 kB at 2.8 MB/s)
[INFO] Downloading from central:
https://repo.maven.apache.org/maven2/org/codehaus/plexus/plexus-io/2.6/plexus-io-2.6.jar
[INFO] Downloaded from central:
https://repo.maven.apache.org/maven2/org/apache/maven/shared/file-management/1.1/file-management-1.1.jar
(31 kB at 1.1 MB/s)
[INFO] Downloading from central:
https://repo.maven.apache.org/maven2/org/apache/maven/shared/maven-repository-builder/1.0/maven-repository-builder-1.0.jar
[INFO] Downloaded from central:
https://repo.maven.apache.org/maven2/org/iq80/snappy/snappy/0.3/snappy-0.3.jar
(49 kB at 1.6 MB/s)
[INFO] Downloaded from central:
https://repo.maven.apache.org/maven2/org/apache/maven/shared/maven-filtering/1.3/maven-filtering-1.3.jar
(51 kB at 1.7 MB/s)
[INFO] Downloaded from central:
https://repo.maven.apache.org/maven2/org/codehaus/plexus/plexus-archiver/3.0.1/plexus-archiver-3.0.1.jar
(381 kB at 8.9 MB/s)
[INFO] Downloaded from central:
https://repo.maven.apache.org/maven2/org/codehaus/plexus/plexus-io/2.6/plexus-io-2.6.jar
(84 kB at 1.7 MB/s)
[INFO] Downloaded from central:
https://repo.maven.apache.org/maven2/org/apache/maven/shared/maven-repository-builder/1.0/maven-repository-builder-1.0.jar
(22 kB at 425 kB/s)
[INFO] Reading assembly descriptor: src/assembly/bin.xml
[INFO] Reading assembly descriptor: src/assembly/src.xml
[INFO] Building tar: <
https://builds.apache.org/job/commons-csv/ws/target/commons-csv-1.6-SNAPSHOT-bin.tar.gz
>
[INFO] Building zip: <
https://builds.apache.org/job/commons-csv/ws/target/commons-csv-1.6-SNAPSHOT-bin.zip
>
[INFO] Building tar: <
https://builds.apache.org/job/commons-csv/ws/target/commons-csv-1.6-SNAPSHOT-src.tar.gz
>
[INFO] Building zip: <
https://builds.apache.org/job/commons-csv/ws/target/commons-csv-1.6-SNAPSHOT-src.zip
>
[INFO]
[INFO] --- maven-gpg-plugin:1.6:sign (sign-artifacts) @ commons-csv ---
[INFO]
[INFO] --- jacoco-maven-plugin:0.7.9:check (check) @ commons-csv ---
[INFO] Loading execution data file <
https://builds.apache.org/job/commons-csv/ws/target/jacoco.exec>
[INFO] Analyzed bundle 'commons-csv' with 15 classes
[INFO] All coverage checks have been met.
[INFO]
[INFO] --- maven-install-plugin:2.5.2:install (default-install) @
commons-csv ---
[INFO] Installing <
https://builds.apache.org/job/commons-csv/ws/target/commons-csv-1.6-SNAPSHOT.jar>
to
/home/jenkins/jenkins-slave/maven-repositories/1/org/apache/commons/commons-csv/1.6-SNAPSHOT/commons-csv-1.6-SNAPSHOT.jar
[INFO] Installing <https://builds.apache.org/job/commons-csv/ws/pom.xml> to
/home/jenkins/jenkins-slave/maven-repositories/1/org/apache/commons/commons-csv/1.6-SNAPSHOT/commons-csv-1.6-SNAPSHOT.pom
[INFO] Installing <
https://builds.apache.org/job/commons-csv/ws/target/commons-csv-1.6-SNAPSHOT-javadoc.jar>
to
/home/jenkins/jenkins-slave/maven-repositories/1/org/apache/commons/commons-csv/1.6-SNAPSHOT/commons-csv-1.6-SNAPSHOT-javadoc.jar
[INFO] Installing <
https://builds.apache.org/job/commons-csv/ws/target/commons-csv-1.6-SNAPSHOT-sources.jar>
to
/home/jenkins/jenkins-slave/maven-repositories/1/org/apache/commons/commons-csv/1.6-SNAPSHOT/commons-csv-1.6-SNAPSHOT-sources.jar
[INFO] Installing <
https://builds.apache.org/job/commons-csv/ws/target/commons-csv-1.6-SNAPSHOT-test-sources.jar>
to
/home/jenkins/jenkins-slave/maven-repositories/1/org/apache/commons/commons-csv/1.6-SNAPSHOT/commons-csv-1.6-SNAPSHOT-test-sources.jar
[INFO] Installing <
https://builds.apache.org/job/commons-csv/ws/target/commons-csv-1.6-SNAPSHOT-tests.jar>
to
/home/jenkins/jenkins-slave/maven-repositories/1/org/apache/commons/commons-csv/1.6-SNAPSHOT/commons-csv-1.6-SNAPSHOT-tests.jar
[INFO] Installing <
https://builds.apache.org/job/commons-csv/ws/target/commons-csv-1.6-SNAPSHOT-bin.tar.gz>
to
/home/jenkins/jenkins-slave/maven-repositories/1/org/apache/commons/commons-csv/1.6-SNAPSHOT/commons-csv-1.6-SNAPSHOT-bin.tar.gz
[INFO] Installing <
https://builds.apache.org/job/commons-csv/ws/target/commons-csv-1.6-SNAPSHOT-bin.zip>
to
/home/jenkins/jenkins-slave/maven-repositories/1/org/apache/commons/commons-csv/1.6-SNAPSHOT/commons-csv-1.6-SNAPSHOT-bin.zip
[INFO] Installing <
https://builds.apache.org/job/commons-csv/ws/target/commons-csv-1.6-SNAPSHOT-src.tar.gz>
to
/home/jenkins/jenkins-slave/maven-repositories/1/org/apache/commons/commons-csv/1.6-SNAPSHOT/commons-csv-1.6-SNAPSHOT-src.tar.gz
[INFO] Installing <
https://builds.apache.org/job/commons-csv/ws/target/commons-csv-1.6-SNAPSHOT-src.zip>
to
/home/jenkins/jenkins-slave/maven-repositories/1/org/apache/commons/commons-csv/1.6-SNAPSHOT/commons-csv-1.6-SNAPSHOT-src.zip
[WARNING] Attempt to (de-)serialize anonymous class
hudson.maven.reporters.MavenArtifactArchiver$2; see:
https://jenkins.io/redirect/serialization-of-anonymous-classes/
[WARNING] Attempt to (de-)serialize anonymous class
hudson.maven.reporters.MavenFingerprinter$1; see:
https://jenkins.io/redirect/serialization-of-anonymous-classes/
[INFO]
------------------------------------------------------------------------
[INFO] BUILD SUCCESS
[INFO]
------------------------------------------------------------------------
[INFO] Total time: 01:51 min
[INFO] Finished at: 2018-08-20T06:49:51Z
[INFO] Final Memory: 60M/3925M
[INFO]
------------------------------------------------------------------------
Waiting for Jenkins to finish collecting data
[JENKINS] Archiving <https://builds.apache.org/job/commons-csv/ws/pom.xml>
to org.apache.commons/commons-csv/1.6-SNAPSHOT/commons-csv-1.6-SNAPSHOT.pom
[JENKINS] Archiving <
https://builds.apache.org/job/commons-csv/ws/target/commons-csv-1.6-SNAPSHOT.jar>
to org.apache.commons/commons-csv/1.6-SNAPSHOT/commons-csv-1.6-SNAPSHOT.jar
[JENKINS] Archiving <
https://builds.apache.org/job/commons-csv/ws/target/commons-csv-1.6-SNAPSHOT-javadoc.jar>
to
org.apache.commons/commons-csv/1.6-SNAPSHOT/commons-csv-1.6-SNAPSHOT-javadoc.jar
[JENKINS] Archiving <
https://builds.apache.org/job/commons-csv/ws/target/commons-csv-1.6-SNAPSHOT-sources.jar>
to
org.apache.commons/commons-csv/1.6-SNAPSHOT/commons-csv-1.6-SNAPSHOT-sources.jar
[JENKINS] Archiving <
https://builds.apache.org/job/commons-csv/ws/target/commons-csv-1.6-SNAPSHOT-test-sources.jar>
to
org.apache.commons/commons-csv/1.6-SNAPSHOT/commons-csv-1.6-SNAPSHOT-test-sources.jar
[JENKINS] Archiving <
https://builds.apache.org/job/commons-csv/ws/target/commons-csv-1.6-SNAPSHOT-tests.jar>
to
org.apache.commons/commons-csv/1.6-SNAPSHOT/commons-csv-1.6-SNAPSHOT-tests.jar
[JENKINS] Archiving <
https://builds.apache.org/job/commons-csv/ws/target/commons-csv-1.6-SNAPSHOT-bin.tar.gz>
to
org.apache.commons/commons-csv/1.6-SNAPSHOT/commons-csv-1.6-SNAPSHOT-bin.tar.gz
[JENKINS] Archiving <
https://builds.apache.org/job/commons-csv/ws/target/commons-csv-1.6-SNAPSHOT-bin.zip>
to
org.apache.commons/commons-csv/1.6-SNAPSHOT/commons-csv-1.6-SNAPSHOT-bin.zip
[JENKINS] Archiving <
https://builds.apache.org/job/commons-csv/ws/target/commons-csv-1.6-SNAPSHOT-src.tar.gz>
to
org.apache.commons/commons-csv/1.6-SNAPSHOT/commons-csv-1.6-SNAPSHOT-src.tar.gz
[JENKINS] Archiving <
https://builds.apache.org/job/commons-csv/ws/target/commons-csv-1.6-SNAPSHOT-src.zip>
to
org.apache.commons/commons-csv/1.6-SNAPSHOT/commons-csv-1.6-SNAPSHOT-src.zip
[Fast Archiver] Compressed 141.28 MB of artifacts by 74.4% relative to #87
channel stopped
Maven RedeployPublisher use remote beam2 maven settings from :
/home/jenkins/.m2/settings.xml
[INFO] Deployment in
https://repository.apache.org/content/repositories/snapshots
(id=apache.snapshots.https,uniqueVersion=true)
Deploying the main artifact commons-csv-1.6-SNAPSHOT.jar
Downloading:
https://repository.apache.org/content/repositories/snapshots/org/apache/commons/commons-csv/1.6-SNAPSHOT/maven-metadata.xml
Downloaded:
https://repository.apache.org/content/repositories/snapshots/org/apache/commons/commons-csv/1.6-SNAPSHOT/maven-metadata.xml
(3 KB at 2.6 KB/sec)
Uploading:
https://repository.apache.org/content/repositories/snapshots/org/apache/commons/commons-csv/1.6-SNAPSHOT/commons-csv-1.6-20180820.065008-25.jar
Uploading:
https://repository.apache.org/content/repositories/snapshots/org/apache/commons/commons-csv/1.6-SNAPSHOT/commons-csv-1.6-20180820.065008-25.pom
ERROR: Failed to deploy artifacts: Could not transfer artifact
org.apache.commons:commons-csv:jar:1.6-20180820.065008-25 from/to
apache.snapshots.https (
https://repository.apache.org/content/repositories/snapshots): Failed to
transfer file:
https://repository.apache.org/content/repositories/snapshots/org/apache/commons/commons-csv/1.6-SNAPSHOT/commons-csv-1.6-20180820.065008-25.jar.
Return code is: 401, ReasonPhrase: Unauthorized.
org.apache.maven.artifact.deployer.ArtifactDeploymentException: Failed to
deploy artifacts: Could not transfer artifact
org.apache.commons:commons-csv:jar:1.6-20180820.065008-25 from/to
apache.snapshots.https (
https://repository.apache.org/content/repositories/snapshots): Failed to
transfer file:
https://repository.apache.org/content/repositories/snapshots/org/apache/commons/commons-csv/1.6-SNAPSHOT/commons-csv-1.6-20180820.065008-25.jar.
Return code is: 401, ReasonPhrase: Unauthorized.
        at
org.apache.maven.artifact.deployer.DefaultArtifactDeployer.deploy(DefaultArtifactDeployer.java:143)
        at
hudson.maven.reporters.MavenArtifactRecord.deploy(MavenArtifactRecord.java:193)
        at
hudson.maven.RedeployPublisher.perform(RedeployPublisher.java:176)
        at hudson.tasks.BuildStepMonitor$1.perform(BuildStepMonitor.java:20)
        at
hudson.model.AbstractBuild$AbstractBuildExecution.perform(AbstractBuild.java:744)
        at
hudson.model.AbstractBuild$AbstractBuildExecution.performAllBuildSteps(AbstractBuild.java:690)
        at
hudson.maven.MavenModuleSetBuild$MavenModuleSetBuildExecution.post2(MavenModuleSetBuild.java:1073)
        at
hudson.model.AbstractBuild$AbstractBuildExecution.post(AbstractBuild.java:635)
        at hudson.model.Run.execute(Run.java:1819)
        at
hudson.maven.MavenModuleSetBuild.run(MavenModuleSetBuild.java:543)
        at
hudson.model.ResourceController.execute(ResourceController.java:97)
        at hudson.model.Executor.run(Executor.java:429)
Caused by: org.eclipse.aether.deployment.DeploymentException: Failed to
deploy artifacts: Could not transfer artifact
org.apache.commons:commons-csv:jar:1.6-20180820.065008-25 from/to
apache.snapshots.https (
https://repository.apache.org/content/repositories/snapshots): Failed to
transfer file:
https://repository.apache.org/content/repositories/snapshots/org/apache/commons/commons-csv/1.6-SNAPSHOT/commons-csv-1.6-20180820.065008-25.jar.
Return code is: 401, ReasonPhrase: Unauthorized.
        at
org.eclipse.aether.internal.impl.DefaultDeployer.deploy(DefaultDeployer.java:317)
        at
org.eclipse.aether.internal.impl.DefaultDeployer.deploy(DefaultDeployer.java:245)
        at
org.eclipse.aether.internal.impl.DefaultRepositorySystem.deploy(DefaultRepositorySystem.java:420)
        at
org.apache.maven.artifact.deployer.DefaultArtifactDeployer.deploy(DefaultArtifactDeployer.java:139)
        ... 11 more
Caused by: org.eclipse.aether.transfer.ArtifactTransferException: Could not
transfer artifact org.apache.commons:commons-csv:jar:1.6-20180820.065008-25
from/to apache.snapshots.https (
https://repository.apache.org/content/repositories/snapshots): Failed to
transfer file:
https://repository.apache.org/content/repositories/snapshots/org/apache/commons/commons-csv/1.6-SNAPSHOT/commons-csv-1.6-20180820.065008-25.jar.
Return code is: 401, ReasonPhrase: Unauthorized.
        at
org.eclipse.aether.connector.basic.ArtifactTransportListener.transferFailed(ArtifactTransportListener.java:43)
        at
org.eclipse.aether.connector.basic.BasicRepositoryConnector$TaskRunner.run(BasicRepositoryConnector.java:355)
        at
org.eclipse.aether.connector.basic.BasicRepositoryConnector.put(BasicRepositoryConnector.java:274)
        at
org.eclipse.aether.internal.impl.DefaultDeployer.deploy(DefaultDeployer.java:311)
        ... 14 more
Caused by: org.apache.maven.wagon.TransferFailedException: Failed to
transfer file:
https://repository.apache.org/content/repositories/snapshots/org/apache/commons/commons-csv/1.6-SNAPSHOT/commons-csv-1.6-20180820.065008-25.jar.
Return code is: 401, ReasonPhrase: Unauthorized.
        at
org.apache.maven.wagon.shared.http.AbstractHttpClientWagon.put(AbstractHttpClientWagon.java:635)
        at
org.apache.maven.wagon.shared.http.AbstractHttpClientWagon.put(AbstractHttpClientWagon.java:557)
        at
org.apache.maven.wagon.shared.http.AbstractHttpClientWagon.put(AbstractHttpClientWagon.java:539)
        at
org.apache.maven.wagon.shared.http.AbstractHttpClientWagon.put(AbstractHttpClientWagon.java:533)
        at
org.apache.maven.wagon.shared.http.AbstractHttpClientWagon.put(AbstractHttpClientWagon.java:513)
        at
org.eclipse.aether.transport.wagon.WagonTransporter$PutTaskRunner.run(WagonTransporter.java:644)
        at
org.eclipse.aether.transport.wagon.WagonTransporter.execute(WagonTransporter.java:427)
        at
org.eclipse.aether.transport.wagon.WagonTransporter.put(WagonTransporter.java:410)
        at
org.eclipse.aether.connector.basic.BasicRepositoryConnector$PutTaskRunner.runTask(BasicRepositoryConnector.java:510)
        at
org.eclipse.aether.connector.basic.BasicRepositoryConnector$TaskRunner.run(BasicRepositoryConnector.java:350)
        ... 16 more
[INFO] Deployment failed after 2.7 sec
Build step 'Deploy artifacts to Maven repository' changed build result to
FAILURE
Reply | Threaded
Open this post in threaded view
|

Re: Build failed in Jenkins: commons-csv #88

sebb-2-2
Best to ask on the builds@ list

On 20 August 2018 at 17:53, Benedikt Ritter <[hidden email]> wrote:

> These failures don't seem to be related to my changes. Any idea how to fix
> this?
>
> ---------- Forwarded message ---------
> From: Apache Jenkins Server <[hidden email]>
> Date: Mo., 20. Aug. 2018 um 08:50 Uhr
> Subject: Build failed in Jenkins: commons-csv #88
> To: <[hidden email]>
>
>
> See <
> https://builds.apache.org/job/commons-csv/88/display/redirect?page=changes>
>
> Changes:
>
> [britter] Add missing predefined formats to class documentation
>
> ------------------------------------------
> [...truncated 155.25 KB...]
> [INFO] Downloaded from central:
> https://repo.maven.apache.org/maven2/org/apache/httpcomponents/httpcore/4.4.4/httpcore-4.4.4.pom
> (5.5 kB at 240 kB/s)
> [INFO] Downloading from central:
> https://repo.maven.apache.org/maven2/org/apache/httpcomponents/httpcomponents-core/4.4.4/httpcomponents-core-4.4.4.pom
> [INFO] Downloaded from central:
> https://repo.maven.apache.org/maven2/org/apache/httpcomponents/httpcomponents-core/4.4.4/httpcomponents-core-4.4.4.pom
> (13 kB at 537 kB/s)
> [INFO] Downloading from central:
> https://repo.maven.apache.org/maven2/commons-codec/commons-codec/1.9/commons-codec-1.9.pom
> [INFO] Downloaded from central:
> https://repo.maven.apache.org/maven2/commons-codec/commons-codec/1.9/commons-codec-1.9.pom
> (12 kB at 481 kB/s)
> [INFO] Downloading from central:
> https://repo.maven.apache.org/maven2/org/apache/commons/commons-parent/32/commons-parent-32.pom
> [INFO] Downloaded from central:
> https://repo.maven.apache.org/maven2/org/apache/commons/commons-parent/32/commons-parent-32.pom
> (53 kB at 2.1 MB/s)
> [INFO] Downloading from central:
> https://repo.maven.apache.org/maven2/org/codehaus/plexus/plexus-java/0.9.5/plexus-java-0.9.5.pom
> [INFO] Downloaded from central:
> https://repo.maven.apache.org/maven2/org/codehaus/plexus/plexus-java/0.9.5/plexus-java-0.9.5.pom
> (2.4 kB at 97 kB/s)
> [INFO] Downloading from central:
> https://repo.maven.apache.org/maven2/org/codehaus/plexus/plexus-languages/0.9.5/plexus-languages-0.9.5.pom
> [INFO] Downloaded from central:
> https://repo.maven.apache.org/maven2/org/codehaus/plexus/plexus-languages/0.9.5/plexus-languages-0.9.5.pom
> (2.3 kB at 95 kB/s)
> [INFO] Downloading from central:
> https://repo.maven.apache.org/maven2/org/ow2/asm/asm/6.0/asm-6.0.pom
> [INFO] Downloaded from central:
> https://repo.maven.apache.org/maven2/org/ow2/asm/asm/6.0/asm-6.0.pom (1.9
> kB at 84 kB/s)
> [INFO] Downloading from central:
> https://repo.maven.apache.org/maven2/org/ow2/asm/asm-parent/6.0/asm-parent-6.0.pom
> [INFO] Downloaded from central:
> https://repo.maven.apache.org/maven2/org/ow2/asm/asm-parent/6.0/asm-parent-6.0.pom
> (5.5 kB at 229 kB/s)
> [INFO] Downloading from central:
> https://repo.maven.apache.org/maven2/org/codehaus/plexus/plexus-container-default/1.0-alpha-7/plexus-container-default-1.0-alpha-7.pom
> [INFO] Downloaded from central:
> https://repo.maven.apache.org/maven2/org/codehaus/plexus/plexus-container-default/1.0-alpha-7/plexus-container-default-1.0-alpha-7.pom
> (1.3 kB at 56 kB/s)
> [INFO] Downloading from central:
> https://repo.maven.apache.org/maven2/plexus/plexus-containers/1.0.2/plexus-containers-1.0.2.pom
> [INFO] Downloaded from central:
> https://repo.maven.apache.org/maven2/plexus/plexus-containers/1.0.2/plexus-containers-1.0.2.pom
> (471 B at 20 kB/s)
> [INFO] Downloading from central:
> https://repo.maven.apache.org/maven2/plexus/plexus-root/1.0.3/plexus-root-1.0.3.pom
> [INFO] Downloaded from central:
> https://repo.maven.apache.org/maven2/plexus/plexus-root/1.0.3/plexus-root-1.0.3.pom
> (6.0 kB at 262 kB/s)
> [INFO] Downloading from central:
> https://repo.maven.apache.org/maven2/org/apache/maven/shared/maven-shared-utils/3.0.1/maven-shared-utils-3.0.1.jar
> [INFO] Downloading from central:
> https://repo.maven.apache.org/maven2/org/apache/maven/shared/maven-invoker/2.2/maven-invoker-2.2.jar
> [INFO] Downloading from central:
> https://repo.maven.apache.org/maven2/org/apache/maven/shared/maven-common-artifact-filters/3.0.0/maven-common-artifact-filters-3.0.0.jar
> [INFO] Downloading from central:
> https://repo.maven.apache.org/maven2/org/apache/maven/shared/maven-artifact-transfer/0.9.1/maven-artifact-transfer-0.9.1.jar
> [INFO] Downloading from central:
> https://repo.maven.apache.org/maven2/org/slf4j/slf4j-api/1.7.5/slf4j-api-1.7.5.jar
> [INFO] Downloaded from central:
> https://repo.maven.apache.org/maven2/org/apache/maven/shared/maven-invoker/2.2/maven-invoker-2.2.jar
> (30 kB at 1.1 MB/s)
> [INFO] Downloading from central:
> https://repo.maven.apache.org/maven2/org/apache/maven/doxia/doxia-sink-api/1.7/doxia-sink-api-1.7.jar
> [INFO] Downloaded from central:
> https://repo.maven.apache.org/maven2/org/apache/maven/shared/maven-shared-utils/3.0.1/maven-shared-utils-3.0.1.jar
> (154 kB at 5.1 MB/s)
> [INFO] Downloading from central:
> https://repo.maven.apache.org/maven2/org/apache/maven/doxia/doxia-logging-api/1.7/doxia-logging-api-1.7.jar
> [INFO] Downloaded from central:
> https://repo.maven.apache.org/maven2/org/apache/maven/shared/maven-artifact-transfer/0.9.1/maven-artifact-transfer-0.9.1.jar
> (123 kB at 4.1 MB/s)
> [INFO] Downloading from central:
> https://repo.maven.apache.org/maven2/org/apache/maven/doxia/doxia-site-renderer/1.7.4/doxia-site-renderer-1.7.4.jar
> [INFO] Downloaded from central:
> https://repo.maven.apache.org/maven2/org/slf4j/slf4j-api/1.7.5/slf4j-api-1.7.5.jar
> (26 kB at 869 kB/s)
> [INFO] Downloaded from central:
> https://repo.maven.apache.org/maven2/org/apache/maven/shared/maven-common-artifact-filters/3.0.0/maven-common-artifact-filters-3.0.0.jar
> (57 kB at 1.8 MB/s)
> [INFO] Downloading from central:
> https://repo.maven.apache.org/maven2/org/apache/maven/doxia/doxia-core/1.7/doxia-core-1.7.jar
> [INFO] Downloading from central:
> https://repo.maven.apache.org/maven2/xmlunit/xmlunit/1.5/xmlunit-1.5.jar
> [INFO] Downloaded from central:
> https://repo.maven.apache.org/maven2/org/apache/maven/doxia/doxia-sink-api/1.7/doxia-sink-api-1.7.jar
> (11 kB at 233 kB/s)
> [INFO] Downloading from central:
> https://repo.maven.apache.org/maven2/org/apache/maven/doxia/doxia-decoration-model/1.7.4/doxia-decoration-model-1.7.4.jar
> [INFO] Downloaded from central:
> https://repo.maven.apache.org/maven2/org/apache/maven/doxia/doxia-logging-api/1.7/doxia-logging-api-1.7.jar
> (12 kB at 227 kB/s)
> [INFO] Downloading from central:
> https://repo.maven.apache.org/maven2/org/apache/maven/doxia/doxia-skin-model/1.7.4/doxia-skin-model-1.7.4.jar
> [INFO] Downloaded from central:
> https://repo.maven.apache.org/maven2/org/apache/maven/doxia/doxia-site-renderer/1.7.4/doxia-site-renderer-1.7.4.jar
> (64 kB at 1.2 MB/s)
> [INFO] Downloading from central:
> https://repo.maven.apache.org/maven2/org/apache/maven/doxia/doxia-module-xhtml/1.7/doxia-module-xhtml-1.7.jar
> [INFO] Downloaded from central:
> https://repo.maven.apache.org/maven2/xmlunit/xmlunit/1.5/xmlunit-1.5.jar
> (98 kB at 1.8 MB/s)
> [INFO] Downloading from central:
> https://repo.maven.apache.org/maven2/org/apache/commons/commons-lang3/3.5/commons-lang3-3.5.jar
> [INFO] Downloaded from central:
> https://repo.maven.apache.org/maven2/org/apache/maven/doxia/doxia-core/1.7/doxia-core-1.7.jar
> (167 kB at 2.9 MB/s)
> [INFO] Downloading from central:
> https://repo.maven.apache.org/maven2/org/apache/httpcomponents/httpclient/4.5.2/httpclient-4.5.2.jar
> [INFO] Downloaded from central:
> https://repo.maven.apache.org/maven2/org/apache/maven/doxia/doxia-decoration-model/1.7.4/doxia-decoration-model-1.7.4.jar
> (61 kB at 819 kB/s)
> [INFO] Downloaded from central:
> https://repo.maven.apache.org/maven2/org/apache/maven/doxia/doxia-skin-model/1.7.4/doxia-skin-model-1.7.4.jar
> (16 kB at 213 kB/s)
> [INFO] Downloading from central:
> https://repo.maven.apache.org/maven2/org/apache/httpcomponents/httpcore/4.4.4/httpcore-4.4.4.jar
> [INFO] Downloading from central:
> https://repo.maven.apache.org/maven2/commons-logging/commons-logging/1.2/commons-logging-1.2.jar
> [INFO] Downloaded from central:
> https://repo.maven.apache.org/maven2/org/apache/maven/doxia/doxia-module-xhtml/1.7/doxia-module-xhtml-1.7.jar
> (17 kB at 224 kB/s)
> [INFO] Downloading from central:
> https://repo.maven.apache.org/maven2/org/codehaus/plexus/plexus-java/0.9.5/plexus-java-0.9.5.jar
> [INFO] Downloaded from central:
> https://repo.maven.apache.org/maven2/org/apache/commons/commons-lang3/3.5/commons-lang3-3.5.jar
> (480 kB at 5.1 MB/s)
> [INFO] Downloading from central:
> https://repo.maven.apache.org/maven2/org/ow2/asm/asm/6.0/asm-6.0.jar
> [INFO] Downloaded from central:
> https://repo.maven.apache.org/maven2/commons-logging/commons-logging/1.2/commons-logging-1.2.jar
> (62 kB at 606 kB/s)
> [INFO] Downloaded from central:
> https://repo.maven.apache.org/maven2/org/codehaus/plexus/plexus-java/0.9.5/plexus-java-0.9.5.jar
> (32 kB at 312 kB/s)
> [INFO] Downloaded from central:
> https://repo.maven.apache.org/maven2/org/apache/httpcomponents/httpclient/4.5.2/httpclient-4.5.2.jar
> (737 kB at 7.0 MB/s)
> [INFO] Downloaded from central:
> https://repo.maven.apache.org/maven2/org/apache/httpcomponents/httpcore/4.4.4/httpcore-4.4.4.jar
> (327 kB at 3.0 MB/s)
> [INFO] Downloaded from central:
> https://repo.maven.apache.org/maven2/org/ow2/asm/asm/6.0/asm-6.0.jar (95 kB
> at 787 kB/s)
> [JENKINS] Archiving  javadoc
> [WARNING] Attempt to (de-)serialize anonymous class hudson.FilePath$32;
> see: https://jenkins.io/redirect/serialization-of-anonymous-classes/
> [INFO]
> [INFO] --- maven-javadoc-plugin:3.0.0:jar (create-javadoc-jar) @
> commons-csv ---
> [INFO] Building jar: <
> https://builds.apache.org/job/commons-csv/ws/target/commons-csv-1.6-SNAPSHOT-javadoc.jar
>>
> [INFO]
> [INFO] >>> maven-source-plugin:3.0.1:jar (create-source-jar) >
> generate-sources @ commons-csv >>>
> [INFO]
> [INFO] --- maven-enforcer-plugin:1.4.1:enforce (enforce-maven-3) @
> commons-csv ---
> [INFO]
> [INFO] --- build-helper-maven-plugin:3.0.0:parse-version (parse-version) @
> commons-csv ---
> [INFO]
> [INFO] --- maven-antrun-plugin:1.8:run (javadoc.resources) @ commons-csv ---
> [INFO] Executing tasks
>
> main:
> [INFO] Executed tasks
> [WARNING] Failed to getClass for
> org.apache.maven.plugins.source.SourceJarMojo
> [INFO]
> [INFO] <<< maven-source-plugin:3.0.1:jar (create-source-jar) <
> generate-sources @ commons-csv <<<
> [INFO]
> [INFO]
> [INFO] --- maven-source-plugin:3.0.1:jar (create-source-jar) @ commons-csv
> ---
> [INFO] Building jar: <
> https://builds.apache.org/job/commons-csv/ws/target/commons-csv-1.6-SNAPSHOT-sources.jar
>>
> [INFO]
> [INFO] >>> maven-source-plugin:3.0.1:test-jar (create-source-jar) >
> generate-sources @ commons-csv >>>
> [INFO]
> [INFO] --- maven-enforcer-plugin:1.4.1:enforce (enforce-maven-3) @
> commons-csv ---
> [INFO]
> [INFO] --- build-helper-maven-plugin:3.0.0:parse-version (parse-version) @
> commons-csv ---
> [INFO]
> [INFO] --- maven-antrun-plugin:1.8:run (javadoc.resources) @ commons-csv ---
> [INFO] Executing tasks
>
> main:
> [INFO] Executed tasks
> [WARNING] Failed to getClass for
> org.apache.maven.plugins.source.TestSourceJarMojo
> [INFO]
> [INFO] <<< maven-source-plugin:3.0.1:test-jar (create-source-jar) <
> generate-sources @ commons-csv <<<
> [INFO]
> [INFO]
> [INFO] --- maven-source-plugin:3.0.1:test-jar (create-source-jar) @
> commons-csv ---
> [INFO] Building jar: <
> https://builds.apache.org/job/commons-csv/ws/target/commons-csv-1.6-SNAPSHOT-test-sources.jar
>>
> [INFO]
> [INFO] --- maven-jar-plugin:3.0.0:test-jar (default) @ commons-csv ---
> [INFO] Building jar: <
> https://builds.apache.org/job/commons-csv/ws/target/commons-csv-1.6-SNAPSHOT-tests.jar
>>
> [INFO]
> [INFO] --- maven-assembly-plugin:2.6:single (default) @ commons-csv ---
> [INFO] Downloading from central:
> https://repo.maven.apache.org/maven2/org/codehaus/plexus/plexus-archiver/3.0.1/plexus-archiver-3.0.1.pom
> [INFO] Downloaded from central:
> https://repo.maven.apache.org/maven2/org/codehaus/plexus/plexus-archiver/3.0.1/plexus-archiver-3.0.1.pom
> (5.8 kB at 214 kB/s)
> [INFO] Downloading from central:
> https://repo.maven.apache.org/maven2/org/codehaus/plexus/plexus-io/2.6/plexus-io-2.6.pom
> [INFO] Downloaded from central:
> https://repo.maven.apache.org/maven2/org/codehaus/plexus/plexus-io/2.6/plexus-io-2.6.pom
> (3.9 kB at 164 kB/s)
> [INFO] Downloading from central:
> https://repo.maven.apache.org/maven2/org/iq80/snappy/snappy/0.3/snappy-0.3.pom
> [INFO] Downloaded from central:
> https://repo.maven.apache.org/maven2/org/iq80/snappy/snappy/0.3/snappy-0.3.pom
> (14 kB at 600 kB/s)
> [INFO] Downloading from central:
> https://repo.maven.apache.org/maven2/org/apache/maven/shared/file-management/1.1/file-management-1.1.pom
> [INFO] Downloaded from central:
> https://repo.maven.apache.org/maven2/org/apache/maven/shared/file-management/1.1/file-management-1.1.pom
> (2.7 kB at 111 kB/s)
> [INFO] Downloading from central:
> https://repo.maven.apache.org/maven2/org/apache/maven/shared/maven-shared-components/4/maven-shared-components-4.pom
> [INFO] Downloaded from central:
> https://repo.maven.apache.org/maven2/org/apache/maven/shared/maven-shared-components/4/maven-shared-components-4.pom
> (2.2 kB at 92 kB/s)
> [INFO] Downloading from central:
> https://repo.maven.apache.org/maven2/org/apache/maven/shared/maven-shared-io/1.0/maven-shared-io-1.0.pom
> [INFO] Downloaded from central:
> https://repo.maven.apache.org/maven2/org/apache/maven/shared/maven-shared-io/1.0/maven-shared-io-1.0.pom
> (3.0 kB at 126 kB/s)
> [INFO] Downloading from central:
> https://repo.maven.apache.org/maven2/org/apache/maven/shared/maven-filtering/1.3/maven-filtering-1.3.pom
> [INFO] Downloaded from central:
> https://repo.maven.apache.org/maven2/org/apache/maven/shared/maven-filtering/1.3/maven-filtering-1.3.pom
> (6.2 kB at 258 kB/s)
> [INFO] Downloading from central:
> https://repo.maven.apache.org/maven2/org/codehaus/plexus/plexus-utils/3.0.18/plexus-utils-3.0.18.pom
> [INFO] Downloaded from central:
> https://repo.maven.apache.org/maven2/org/codehaus/plexus/plexus-utils/3.0.18/plexus-utils-3.0.18.pom
> (3.4 kB at 141 kB/s)
> [INFO] Downloading from central:
> https://repo.maven.apache.org/maven2/org/apache/maven/shared/maven-repository-builder/1.0/maven-repository-builder-1.0.pom
> [INFO] Downloaded from central:
> https://repo.maven.apache.org/maven2/org/apache/maven/shared/maven-repository-builder/1.0/maven-repository-builder-1.0.pom
> (4.6 kB at 190 kB/s)
> [INFO] Downloading from central:
> https://repo.maven.apache.org/maven2/org/apache/maven/maven-artifact/2.0.4/maven-artifact-2.0.4.pom
> [INFO] Downloaded from central:
> https://repo.maven.apache.org/maven2/org/apache/maven/maven-artifact/2.0.4/maven-artifact-2.0.4.pom
> (765 B at 33 kB/s)
> [INFO] Downloading from central:
> https://repo.maven.apache.org/maven2/org/apache/maven/maven/2.0.4/maven-2.0.4.pom
> [INFO] Downloaded from central:
> https://repo.maven.apache.org/maven2/org/apache/maven/maven/2.0.4/maven-2.0.4.pom
> (12 kB at 491 kB/s)
> [INFO] Downloading from central:
> https://repo.maven.apache.org/maven2/org/apache/maven/maven-artifact-manager/2.0.4/maven-artifact-manager-2.0.4.pom
> [INFO] Downloaded from central:
> https://repo.maven.apache.org/maven2/org/apache/maven/maven-artifact-manager/2.0.4/maven-artifact-manager-2.0.4.pom
> (1.4 kB at 59 kB/s)
> [INFO] Downloading from central:
> https://repo.maven.apache.org/maven2/org/apache/maven/maven-repository-metadata/2.0.4/maven-repository-metadata-2.0.4.pom
> [INFO] Downloaded from central:
> https://repo.maven.apache.org/maven2/org/apache/maven/maven-repository-metadata/2.0.4/maven-repository-metadata-2.0.4.pom
> (1.5 kB at 65 kB/s)
> [INFO] Downloading from central:
> https://repo.maven.apache.org/maven2/org/apache/maven/maven-project/2.0.4/maven-project-2.0.4.pom
> [INFO] Downloaded from central:
> https://repo.maven.apache.org/maven2/org/apache/maven/maven-project/2.0.4/maven-project-2.0.4.pom
> (1.8 kB at 77 kB/s)
> [INFO] Downloading from central:
> https://repo.maven.apache.org/maven2/org/apache/maven/maven-settings/2.0.4/maven-settings-2.0.4.pom
> [INFO] Downloaded from central:
> https://repo.maven.apache.org/maven2/org/apache/maven/maven-settings/2.0.4/maven-settings-2.0.4.pom
> (1.6 kB at 71 kB/s)
> [INFO] Downloading from central:
> https://repo.maven.apache.org/maven2/org/apache/maven/maven-model/2.0.4/maven-model-2.0.4.pom
> [INFO] Downloaded from central:
> https://repo.maven.apache.org/maven2/org/apache/maven/maven-model/2.0.4/maven-model-2.0.4.pom
> (2.7 kB at 118 kB/s)
> [INFO] Downloading from central:
> https://repo.maven.apache.org/maven2/org/apache/maven/maven-profile/2.0.4/maven-profile-2.0.4.pom
> [INFO] Downloaded from central:
> https://repo.maven.apache.org/maven2/org/apache/maven/maven-profile/2.0.4/maven-profile-2.0.4.pom
> (1.6 kB at 70 kB/s)
> [INFO] Downloading from central:
> https://repo.maven.apache.org/maven2/org/codehaus/plexus/plexus-interpolation/1.22/plexus-interpolation-1.22.jar
> [INFO] Downloading from central:
> https://repo.maven.apache.org/maven2/org/codehaus/plexus/plexus-archiver/3.0.1/plexus-archiver-3.0.1.jar
> [INFO] Downloading from central:
> https://repo.maven.apache.org/maven2/org/iq80/snappy/snappy/0.3/snappy-0.3.jar
> [INFO] Downloading from central:
> https://repo.maven.apache.org/maven2/org/apache/maven/shared/file-management/1.1/file-management-1.1.jar
> [INFO] Downloading from central:
> https://repo.maven.apache.org/maven2/org/apache/maven/shared/maven-filtering/1.3/maven-filtering-1.3.jar
> [INFO] Downloaded from central:
> https://repo.maven.apache.org/maven2/org/codehaus/plexus/plexus-interpolation/1.22/plexus-interpolation-1.22.jar
> (77 kB at 2.8 MB/s)
> [INFO] Downloading from central:
> https://repo.maven.apache.org/maven2/org/codehaus/plexus/plexus-io/2.6/plexus-io-2.6.jar
> [INFO] Downloaded from central:
> https://repo.maven.apache.org/maven2/org/apache/maven/shared/file-management/1.1/file-management-1.1.jar
> (31 kB at 1.1 MB/s)
> [INFO] Downloading from central:
> https://repo.maven.apache.org/maven2/org/apache/maven/shared/maven-repository-builder/1.0/maven-repository-builder-1.0.jar
> [INFO] Downloaded from central:
> https://repo.maven.apache.org/maven2/org/iq80/snappy/snappy/0.3/snappy-0.3.jar
> (49 kB at 1.6 MB/s)
> [INFO] Downloaded from central:
> https://repo.maven.apache.org/maven2/org/apache/maven/shared/maven-filtering/1.3/maven-filtering-1.3.jar
> (51 kB at 1.7 MB/s)
> [INFO] Downloaded from central:
> https://repo.maven.apache.org/maven2/org/codehaus/plexus/plexus-archiver/3.0.1/plexus-archiver-3.0.1.jar
> (381 kB at 8.9 MB/s)
> [INFO] Downloaded from central:
> https://repo.maven.apache.org/maven2/org/codehaus/plexus/plexus-io/2.6/plexus-io-2.6.jar
> (84 kB at 1.7 MB/s)
> [INFO] Downloaded from central:
> https://repo.maven.apache.org/maven2/org/apache/maven/shared/maven-repository-builder/1.0/maven-repository-builder-1.0.jar
> (22 kB at 425 kB/s)
> [INFO] Reading assembly descriptor: src/assembly/bin.xml
> [INFO] Reading assembly descriptor: src/assembly/src.xml
> [INFO] Building tar: <
> https://builds.apache.org/job/commons-csv/ws/target/commons-csv-1.6-SNAPSHOT-bin.tar.gz
>>
> [INFO] Building zip: <
> https://builds.apache.org/job/commons-csv/ws/target/commons-csv-1.6-SNAPSHOT-bin.zip
>>
> [INFO] Building tar: <
> https://builds.apache.org/job/commons-csv/ws/target/commons-csv-1.6-SNAPSHOT-src.tar.gz
>>
> [INFO] Building zip: <
> https://builds.apache.org/job/commons-csv/ws/target/commons-csv-1.6-SNAPSHOT-src.zip
>>
> [INFO]
> [INFO] --- maven-gpg-plugin:1.6:sign (sign-artifacts) @ commons-csv ---
> [INFO]
> [INFO] --- jacoco-maven-plugin:0.7.9:check (check) @ commons-csv ---
> [INFO] Loading execution data file <
> https://builds.apache.org/job/commons-csv/ws/target/jacoco.exec>
> [INFO] Analyzed bundle 'commons-csv' with 15 classes
> [INFO] All coverage checks have been met.
> [INFO]
> [INFO] --- maven-install-plugin:2.5.2:install (default-install) @
> commons-csv ---
> [INFO] Installing <
> https://builds.apache.org/job/commons-csv/ws/target/commons-csv-1.6-SNAPSHOT.jar>
> to
> /home/jenkins/jenkins-slave/maven-repositories/1/org/apache/commons/commons-csv/1.6-SNAPSHOT/commons-csv-1.6-SNAPSHOT.jar
> [INFO] Installing <https://builds.apache.org/job/commons-csv/ws/pom.xml> to
> /home/jenkins/jenkins-slave/maven-repositories/1/org/apache/commons/commons-csv/1.6-SNAPSHOT/commons-csv-1.6-SNAPSHOT.pom
> [INFO] Installing <
> https://builds.apache.org/job/commons-csv/ws/target/commons-csv-1.6-SNAPSHOT-javadoc.jar>
> to
> /home/jenkins/jenkins-slave/maven-repositories/1/org/apache/commons/commons-csv/1.6-SNAPSHOT/commons-csv-1.6-SNAPSHOT-javadoc.jar
> [INFO] Installing <
> https://builds.apache.org/job/commons-csv/ws/target/commons-csv-1.6-SNAPSHOT-sources.jar>
> to
> /home/jenkins/jenkins-slave/maven-repositories/1/org/apache/commons/commons-csv/1.6-SNAPSHOT/commons-csv-1.6-SNAPSHOT-sources.jar
> [INFO] Installing <
> https://builds.apache.org/job/commons-csv/ws/target/commons-csv-1.6-SNAPSHOT-test-sources.jar>
> to
> /home/jenkins/jenkins-slave/maven-repositories/1/org/apache/commons/commons-csv/1.6-SNAPSHOT/commons-csv-1.6-SNAPSHOT-test-sources.jar
> [INFO] Installing <
> https://builds.apache.org/job/commons-csv/ws/target/commons-csv-1.6-SNAPSHOT-tests.jar>
> to
> /home/jenkins/jenkins-slave/maven-repositories/1/org/apache/commons/commons-csv/1.6-SNAPSHOT/commons-csv-1.6-SNAPSHOT-tests.jar
> [INFO] Installing <
> https://builds.apache.org/job/commons-csv/ws/target/commons-csv-1.6-SNAPSHOT-bin.tar.gz>
> to
> /home/jenkins/jenkins-slave/maven-repositories/1/org/apache/commons/commons-csv/1.6-SNAPSHOT/commons-csv-1.6-SNAPSHOT-bin.tar.gz
> [INFO] Installing <
> https://builds.apache.org/job/commons-csv/ws/target/commons-csv-1.6-SNAPSHOT-bin.zip>
> to
> /home/jenkins/jenkins-slave/maven-repositories/1/org/apache/commons/commons-csv/1.6-SNAPSHOT/commons-csv-1.6-SNAPSHOT-bin.zip
> [INFO] Installing <
> https://builds.apache.org/job/commons-csv/ws/target/commons-csv-1.6-SNAPSHOT-src.tar.gz>
> to
> /home/jenkins/jenkins-slave/maven-repositories/1/org/apache/commons/commons-csv/1.6-SNAPSHOT/commons-csv-1.6-SNAPSHOT-src.tar.gz
> [INFO] Installing <
> https://builds.apache.org/job/commons-csv/ws/target/commons-csv-1.6-SNAPSHOT-src.zip>
> to
> /home/jenkins/jenkins-slave/maven-repositories/1/org/apache/commons/commons-csv/1.6-SNAPSHOT/commons-csv-1.6-SNAPSHOT-src.zip
> [WARNING] Attempt to (de-)serialize anonymous class
> hudson.maven.reporters.MavenArtifactArchiver$2; see:
> https://jenkins.io/redirect/serialization-of-anonymous-classes/
> [WARNING] Attempt to (de-)serialize anonymous class
> hudson.maven.reporters.MavenFingerprinter$1; see:
> https://jenkins.io/redirect/serialization-of-anonymous-classes/
> [INFO]
> ------------------------------------------------------------------------
> [INFO] BUILD SUCCESS
> [INFO]
> ------------------------------------------------------------------------
> [INFO] Total time: 01:51 min
> [INFO] Finished at: 2018-08-20T06:49:51Z
> [INFO] Final Memory: 60M/3925M
> [INFO]
> ------------------------------------------------------------------------
> Waiting for Jenkins to finish collecting data
> [JENKINS] Archiving <https://builds.apache.org/job/commons-csv/ws/pom.xml>
> to org.apache.commons/commons-csv/1.6-SNAPSHOT/commons-csv-1.6-SNAPSHOT.pom
> [JENKINS] Archiving <
> https://builds.apache.org/job/commons-csv/ws/target/commons-csv-1.6-SNAPSHOT.jar>
> to org.apache.commons/commons-csv/1.6-SNAPSHOT/commons-csv-1.6-SNAPSHOT.jar
> [JENKINS] Archiving <
> https://builds.apache.org/job/commons-csv/ws/target/commons-csv-1.6-SNAPSHOT-javadoc.jar>
> to
> org.apache.commons/commons-csv/1.6-SNAPSHOT/commons-csv-1.6-SNAPSHOT-javadoc.jar
> [JENKINS] Archiving <
> https://builds.apache.org/job/commons-csv/ws/target/commons-csv-1.6-SNAPSHOT-sources.jar>
> to
> org.apache.commons/commons-csv/1.6-SNAPSHOT/commons-csv-1.6-SNAPSHOT-sources.jar
> [JENKINS] Archiving <
> https://builds.apache.org/job/commons-csv/ws/target/commons-csv-1.6-SNAPSHOT-test-sources.jar>
> to
> org.apache.commons/commons-csv/1.6-SNAPSHOT/commons-csv-1.6-SNAPSHOT-test-sources.jar
> [JENKINS] Archiving <
> https://builds.apache.org/job/commons-csv/ws/target/commons-csv-1.6-SNAPSHOT-tests.jar>
> to
> org.apache.commons/commons-csv/1.6-SNAPSHOT/commons-csv-1.6-SNAPSHOT-tests.jar
> [JENKINS] Archiving <
> https://builds.apache.org/job/commons-csv/ws/target/commons-csv-1.6-SNAPSHOT-bin.tar.gz>
> to
> org.apache.commons/commons-csv/1.6-SNAPSHOT/commons-csv-1.6-SNAPSHOT-bin.tar.gz
> [JENKINS] Archiving <
> https://builds.apache.org/job/commons-csv/ws/target/commons-csv-1.6-SNAPSHOT-bin.zip>
> to
> org.apache.commons/commons-csv/1.6-SNAPSHOT/commons-csv-1.6-SNAPSHOT-bin.zip
> [JENKINS] Archiving <
> https://builds.apache.org/job/commons-csv/ws/target/commons-csv-1.6-SNAPSHOT-src.tar.gz>
> to
> org.apache.commons/commons-csv/1.6-SNAPSHOT/commons-csv-1.6-SNAPSHOT-src.tar.gz
> [JENKINS] Archiving <
> https://builds.apache.org/job/commons-csv/ws/target/commons-csv-1.6-SNAPSHOT-src.zip>
> to
> org.apache.commons/commons-csv/1.6-SNAPSHOT/commons-csv-1.6-SNAPSHOT-src.zip
> [Fast Archiver] Compressed 141.28 MB of artifacts by 74.4% relative to #87
> channel stopped
> Maven RedeployPublisher use remote beam2 maven settings from :
> /home/jenkins/.m2/settings.xml
> [INFO] Deployment in
> https://repository.apache.org/content/repositories/snapshots
> (id=apache.snapshots.https,uniqueVersion=true)
> Deploying the main artifact commons-csv-1.6-SNAPSHOT.jar
> Downloading:
> https://repository.apache.org/content/repositories/snapshots/org/apache/commons/commons-csv/1.6-SNAPSHOT/maven-metadata.xml
> Downloaded:
> https://repository.apache.org/content/repositories/snapshots/org/apache/commons/commons-csv/1.6-SNAPSHOT/maven-metadata.xml
> (3 KB at 2.6 KB/sec)
> Uploading:
> https://repository.apache.org/content/repositories/snapshots/org/apache/commons/commons-csv/1.6-SNAPSHOT/commons-csv-1.6-20180820.065008-25.jar
> Uploading:
> https://repository.apache.org/content/repositories/snapshots/org/apache/commons/commons-csv/1.6-SNAPSHOT/commons-csv-1.6-20180820.065008-25.pom
> ERROR: Failed to deploy artifacts: Could not transfer artifact
> org.apache.commons:commons-csv:jar:1.6-20180820.065008-25 from/to
> apache.snapshots.https (
> https://repository.apache.org/content/repositories/snapshots): Failed to
> transfer file:
> https://repository.apache.org/content/repositories/snapshots/org/apache/commons/commons-csv/1.6-SNAPSHOT/commons-csv-1.6-20180820.065008-25.jar.
> Return code is: 401, ReasonPhrase: Unauthorized.
> org.apache.maven.artifact.deployer.ArtifactDeploymentException: Failed to
> deploy artifacts: Could not transfer artifact
> org.apache.commons:commons-csv:jar:1.6-20180820.065008-25 from/to
> apache.snapshots.https (
> https://repository.apache.org/content/repositories/snapshots): Failed to
> transfer file:
> https://repository.apache.org/content/repositories/snapshots/org/apache/commons/commons-csv/1.6-SNAPSHOT/commons-csv-1.6-20180820.065008-25.jar.
> Return code is: 401, ReasonPhrase: Unauthorized.
>         at
> org.apache.maven.artifact.deployer.DefaultArtifactDeployer.deploy(DefaultArtifactDeployer.java:143)
>         at
> hudson.maven.reporters.MavenArtifactRecord.deploy(MavenArtifactRecord.java:193)
>         at
> hudson.maven.RedeployPublisher.perform(RedeployPublisher.java:176)
>         at hudson.tasks.BuildStepMonitor$1.perform(BuildStepMonitor.java:20)
>         at
> hudson.model.AbstractBuild$AbstractBuildExecution.perform(AbstractBuild.java:744)
>         at
> hudson.model.AbstractBuild$AbstractBuildExecution.performAllBuildSteps(AbstractBuild.java:690)
>         at
> hudson.maven.MavenModuleSetBuild$MavenModuleSetBuildExecution.post2(MavenModuleSetBuild.java:1073)
>         at
> hudson.model.AbstractBuild$AbstractBuildExecution.post(AbstractBuild.java:635)
>         at hudson.model.Run.execute(Run.java:1819)
>         at
> hudson.maven.MavenModuleSetBuild.run(MavenModuleSetBuild.java:543)
>         at
> hudson.model.ResourceController.execute(ResourceController.java:97)
>         at hudson.model.Executor.run(Executor.java:429)
> Caused by: org.eclipse.aether.deployment.DeploymentException: Failed to
> deploy artifacts: Could not transfer artifact
> org.apache.commons:commons-csv:jar:1.6-20180820.065008-25 from/to
> apache.snapshots.https (
> https://repository.apache.org/content/repositories/snapshots): Failed to
> transfer file:
> https://repository.apache.org/content/repositories/snapshots/org/apache/commons/commons-csv/1.6-SNAPSHOT/commons-csv-1.6-20180820.065008-25.jar.
> Return code is: 401, ReasonPhrase: Unauthorized.
>         at
> org.eclipse.aether.internal.impl.DefaultDeployer.deploy(DefaultDeployer.java:317)
>         at
> org.eclipse.aether.internal.impl.DefaultDeployer.deploy(DefaultDeployer.java:245)
>         at
> org.eclipse.aether.internal.impl.DefaultRepositorySystem.deploy(DefaultRepositorySystem.java:420)
>         at
> org.apache.maven.artifact.deployer.DefaultArtifactDeployer.deploy(DefaultArtifactDeployer.java:139)
>         ... 11 more
> Caused by: org.eclipse.aether.transfer.ArtifactTransferException: Could not
> transfer artifact org.apache.commons:commons-csv:jar:1.6-20180820.065008-25
> from/to apache.snapshots.https (
> https://repository.apache.org/content/repositories/snapshots): Failed to
> transfer file:
> https://repository.apache.org/content/repositories/snapshots/org/apache/commons/commons-csv/1.6-SNAPSHOT/commons-csv-1.6-20180820.065008-25.jar.
> Return code is: 401, ReasonPhrase: Unauthorized.
>         at
> org.eclipse.aether.connector.basic.ArtifactTransportListener.transferFailed(ArtifactTransportListener.java:43)
>         at
> org.eclipse.aether.connector.basic.BasicRepositoryConnector$TaskRunner.run(BasicRepositoryConnector.java:355)
>         at
> org.eclipse.aether.connector.basic.BasicRepositoryConnector.put(BasicRepositoryConnector.java:274)
>         at
> org.eclipse.aether.internal.impl.DefaultDeployer.deploy(DefaultDeployer.java:311)
>         ... 14 more
> Caused by: org.apache.maven.wagon.TransferFailedException: Failed to
> transfer file:
> https://repository.apache.org/content/repositories/snapshots/org/apache/commons/commons-csv/1.6-SNAPSHOT/commons-csv-1.6-20180820.065008-25.jar.
> Return code is: 401, ReasonPhrase: Unauthorized.
>         at
> org.apache.maven.wagon.shared.http.AbstractHttpClientWagon.put(AbstractHttpClientWagon.java:635)
>         at
> org.apache.maven.wagon.shared.http.AbstractHttpClientWagon.put(AbstractHttpClientWagon.java:557)
>         at
> org.apache.maven.wagon.shared.http.AbstractHttpClientWagon.put(AbstractHttpClientWagon.java:539)
>         at
> org.apache.maven.wagon.shared.http.AbstractHttpClientWagon.put(AbstractHttpClientWagon.java:533)
>         at
> org.apache.maven.wagon.shared.http.AbstractHttpClientWagon.put(AbstractHttpClientWagon.java:513)
>         at
> org.eclipse.aether.transport.wagon.WagonTransporter$PutTaskRunner.run(WagonTransporter.java:644)
>         at
> org.eclipse.aether.transport.wagon.WagonTransporter.execute(WagonTransporter.java:427)
>         at
> org.eclipse.aether.transport.wagon.WagonTransporter.put(WagonTransporter.java:410)
>         at
> org.eclipse.aether.connector.basic.BasicRepositoryConnector$PutTaskRunner.runTask(BasicRepositoryConnector.java:510)
>         at
> org.eclipse.aether.connector.basic.BasicRepositoryConnector$TaskRunner.run(BasicRepositoryConnector.java:350)
>         ... 16 more
> [INFO] Deployment failed after 2.7 sec
> Build step 'Deploy artifacts to Maven repository' changed build result to
> FAILURE

---------------------------------------------------------------------
To unsubscribe, e-mail: [hidden email]
For additional commands, e-mail: [hidden email]

Reply | Threaded
Open this post in threaded view
|

Re: Build failed in Jenkins: commons-csv #88

sebb-2-2
In reply to this post by Benedikt Ritter-4
I discovered yesterday that not all of the beam* nodes are set up with
creds for deploying snapshots:

https://issues.apache.org/jira/browse/INFRA-16935

Unless otherwise advised, jobs should be set up to run on ubuntu nodes.

This means ensuring that you enable:
  "Restrict where this project can be run"
and enter the word: ubuntu

I've done this for CSV which has just completed OK.

On 20 August 2018 at 17:53, Benedikt Ritter <[hidden email]> wrote:

> These failures don't seem to be related to my changes. Any idea how to fix
> this?
>
> ---------- Forwarded message ---------
> From: Apache Jenkins Server <[hidden email]>
> Date: Mo., 20. Aug. 2018 um 08:50 Uhr
> Subject: Build failed in Jenkins: commons-csv #88
> To: <[hidden email]>
>
>
> See <
> https://builds.apache.org/job/commons-csv/88/display/redirect?page=changes>
>
> Changes:
>
> [britter] Add missing predefined formats to class documentation
>
> ------------------------------------------
> [...truncated 155.25 KB...]
> [INFO] Downloaded from central:
> https://repo.maven.apache.org/maven2/org/apache/httpcomponents/httpcore/4.4.4/httpcore-4.4.4.pom
> (5.5 kB at 240 kB/s)
> [INFO] Downloading from central:
> https://repo.maven.apache.org/maven2/org/apache/httpcomponents/httpcomponents-core/4.4.4/httpcomponents-core-4.4.4.pom
> [INFO] Downloaded from central:
> https://repo.maven.apache.org/maven2/org/apache/httpcomponents/httpcomponents-core/4.4.4/httpcomponents-core-4.4.4.pom
> (13 kB at 537 kB/s)
> [INFO] Downloading from central:
> https://repo.maven.apache.org/maven2/commons-codec/commons-codec/1.9/commons-codec-1.9.pom
> [INFO] Downloaded from central:
> https://repo.maven.apache.org/maven2/commons-codec/commons-codec/1.9/commons-codec-1.9.pom
> (12 kB at 481 kB/s)
> [INFO] Downloading from central:
> https://repo.maven.apache.org/maven2/org/apache/commons/commons-parent/32/commons-parent-32.pom
> [INFO] Downloaded from central:
> https://repo.maven.apache.org/maven2/org/apache/commons/commons-parent/32/commons-parent-32.pom
> (53 kB at 2.1 MB/s)
> [INFO] Downloading from central:
> https://repo.maven.apache.org/maven2/org/codehaus/plexus/plexus-java/0.9.5/plexus-java-0.9.5.pom
> [INFO] Downloaded from central:
> https://repo.maven.apache.org/maven2/org/codehaus/plexus/plexus-java/0.9.5/plexus-java-0.9.5.pom
> (2.4 kB at 97 kB/s)
> [INFO] Downloading from central:
> https://repo.maven.apache.org/maven2/org/codehaus/plexus/plexus-languages/0.9.5/plexus-languages-0.9.5.pom
> [INFO] Downloaded from central:
> https://repo.maven.apache.org/maven2/org/codehaus/plexus/plexus-languages/0.9.5/plexus-languages-0.9.5.pom
> (2.3 kB at 95 kB/s)
> [INFO] Downloading from central:
> https://repo.maven.apache.org/maven2/org/ow2/asm/asm/6.0/asm-6.0.pom
> [INFO] Downloaded from central:
> https://repo.maven.apache.org/maven2/org/ow2/asm/asm/6.0/asm-6.0.pom (1.9
> kB at 84 kB/s)
> [INFO] Downloading from central:
> https://repo.maven.apache.org/maven2/org/ow2/asm/asm-parent/6.0/asm-parent-6.0.pom
> [INFO] Downloaded from central:
> https://repo.maven.apache.org/maven2/org/ow2/asm/asm-parent/6.0/asm-parent-6.0.pom
> (5.5 kB at 229 kB/s)
> [INFO] Downloading from central:
> https://repo.maven.apache.org/maven2/org/codehaus/plexus/plexus-container-default/1.0-alpha-7/plexus-container-default-1.0-alpha-7.pom
> [INFO] Downloaded from central:
> https://repo.maven.apache.org/maven2/org/codehaus/plexus/plexus-container-default/1.0-alpha-7/plexus-container-default-1.0-alpha-7.pom
> (1.3 kB at 56 kB/s)
> [INFO] Downloading from central:
> https://repo.maven.apache.org/maven2/plexus/plexus-containers/1.0.2/plexus-containers-1.0.2.pom
> [INFO] Downloaded from central:
> https://repo.maven.apache.org/maven2/plexus/plexus-containers/1.0.2/plexus-containers-1.0.2.pom
> (471 B at 20 kB/s)
> [INFO] Downloading from central:
> https://repo.maven.apache.org/maven2/plexus/plexus-root/1.0.3/plexus-root-1.0.3.pom
> [INFO] Downloaded from central:
> https://repo.maven.apache.org/maven2/plexus/plexus-root/1.0.3/plexus-root-1.0.3.pom
> (6.0 kB at 262 kB/s)
> [INFO] Downloading from central:
> https://repo.maven.apache.org/maven2/org/apache/maven/shared/maven-shared-utils/3.0.1/maven-shared-utils-3.0.1.jar
> [INFO] Downloading from central:
> https://repo.maven.apache.org/maven2/org/apache/maven/shared/maven-invoker/2.2/maven-invoker-2.2.jar
> [INFO] Downloading from central:
> https://repo.maven.apache.org/maven2/org/apache/maven/shared/maven-common-artifact-filters/3.0.0/maven-common-artifact-filters-3.0.0.jar
> [INFO] Downloading from central:
> https://repo.maven.apache.org/maven2/org/apache/maven/shared/maven-artifact-transfer/0.9.1/maven-artifact-transfer-0.9.1.jar
> [INFO] Downloading from central:
> https://repo.maven.apache.org/maven2/org/slf4j/slf4j-api/1.7.5/slf4j-api-1.7.5.jar
> [INFO] Downloaded from central:
> https://repo.maven.apache.org/maven2/org/apache/maven/shared/maven-invoker/2.2/maven-invoker-2.2.jar
> (30 kB at 1.1 MB/s)
> [INFO] Downloading from central:
> https://repo.maven.apache.org/maven2/org/apache/maven/doxia/doxia-sink-api/1.7/doxia-sink-api-1.7.jar
> [INFO] Downloaded from central:
> https://repo.maven.apache.org/maven2/org/apache/maven/shared/maven-shared-utils/3.0.1/maven-shared-utils-3.0.1.jar
> (154 kB at 5.1 MB/s)
> [INFO] Downloading from central:
> https://repo.maven.apache.org/maven2/org/apache/maven/doxia/doxia-logging-api/1.7/doxia-logging-api-1.7.jar
> [INFO] Downloaded from central:
> https://repo.maven.apache.org/maven2/org/apache/maven/shared/maven-artifact-transfer/0.9.1/maven-artifact-transfer-0.9.1.jar
> (123 kB at 4.1 MB/s)
> [INFO] Downloading from central:
> https://repo.maven.apache.org/maven2/org/apache/maven/doxia/doxia-site-renderer/1.7.4/doxia-site-renderer-1.7.4.jar
> [INFO] Downloaded from central:
> https://repo.maven.apache.org/maven2/org/slf4j/slf4j-api/1.7.5/slf4j-api-1.7.5.jar
> (26 kB at 869 kB/s)
> [INFO] Downloaded from central:
> https://repo.maven.apache.org/maven2/org/apache/maven/shared/maven-common-artifact-filters/3.0.0/maven-common-artifact-filters-3.0.0.jar
> (57 kB at 1.8 MB/s)
> [INFO] Downloading from central:
> https://repo.maven.apache.org/maven2/org/apache/maven/doxia/doxia-core/1.7/doxia-core-1.7.jar
> [INFO] Downloading from central:
> https://repo.maven.apache.org/maven2/xmlunit/xmlunit/1.5/xmlunit-1.5.jar
> [INFO] Downloaded from central:
> https://repo.maven.apache.org/maven2/org/apache/maven/doxia/doxia-sink-api/1.7/doxia-sink-api-1.7.jar
> (11 kB at 233 kB/s)
> [INFO] Downloading from central:
> https://repo.maven.apache.org/maven2/org/apache/maven/doxia/doxia-decoration-model/1.7.4/doxia-decoration-model-1.7.4.jar
> [INFO] Downloaded from central:
> https://repo.maven.apache.org/maven2/org/apache/maven/doxia/doxia-logging-api/1.7/doxia-logging-api-1.7.jar
> (12 kB at 227 kB/s)
> [INFO] Downloading from central:
> https://repo.maven.apache.org/maven2/org/apache/maven/doxia/doxia-skin-model/1.7.4/doxia-skin-model-1.7.4.jar
> [INFO] Downloaded from central:
> https://repo.maven.apache.org/maven2/org/apache/maven/doxia/doxia-site-renderer/1.7.4/doxia-site-renderer-1.7.4.jar
> (64 kB at 1.2 MB/s)
> [INFO] Downloading from central:
> https://repo.maven.apache.org/maven2/org/apache/maven/doxia/doxia-module-xhtml/1.7/doxia-module-xhtml-1.7.jar
> [INFO] Downloaded from central:
> https://repo.maven.apache.org/maven2/xmlunit/xmlunit/1.5/xmlunit-1.5.jar
> (98 kB at 1.8 MB/s)
> [INFO] Downloading from central:
> https://repo.maven.apache.org/maven2/org/apache/commons/commons-lang3/3.5/commons-lang3-3.5.jar
> [INFO] Downloaded from central:
> https://repo.maven.apache.org/maven2/org/apache/maven/doxia/doxia-core/1.7/doxia-core-1.7.jar
> (167 kB at 2.9 MB/s)
> [INFO] Downloading from central:
> https://repo.maven.apache.org/maven2/org/apache/httpcomponents/httpclient/4.5.2/httpclient-4.5.2.jar
> [INFO] Downloaded from central:
> https://repo.maven.apache.org/maven2/org/apache/maven/doxia/doxia-decoration-model/1.7.4/doxia-decoration-model-1.7.4.jar
> (61 kB at 819 kB/s)
> [INFO] Downloaded from central:
> https://repo.maven.apache.org/maven2/org/apache/maven/doxia/doxia-skin-model/1.7.4/doxia-skin-model-1.7.4.jar
> (16 kB at 213 kB/s)
> [INFO] Downloading from central:
> https://repo.maven.apache.org/maven2/org/apache/httpcomponents/httpcore/4.4.4/httpcore-4.4.4.jar
> [INFO] Downloading from central:
> https://repo.maven.apache.org/maven2/commons-logging/commons-logging/1.2/commons-logging-1.2.jar
> [INFO] Downloaded from central:
> https://repo.maven.apache.org/maven2/org/apache/maven/doxia/doxia-module-xhtml/1.7/doxia-module-xhtml-1.7.jar
> (17 kB at 224 kB/s)
> [INFO] Downloading from central:
> https://repo.maven.apache.org/maven2/org/codehaus/plexus/plexus-java/0.9.5/plexus-java-0.9.5.jar
> [INFO] Downloaded from central:
> https://repo.maven.apache.org/maven2/org/apache/commons/commons-lang3/3.5/commons-lang3-3.5.jar
> (480 kB at 5.1 MB/s)
> [INFO] Downloading from central:
> https://repo.maven.apache.org/maven2/org/ow2/asm/asm/6.0/asm-6.0.jar
> [INFO] Downloaded from central:
> https://repo.maven.apache.org/maven2/commons-logging/commons-logging/1.2/commons-logging-1.2.jar
> (62 kB at 606 kB/s)
> [INFO] Downloaded from central:
> https://repo.maven.apache.org/maven2/org/codehaus/plexus/plexus-java/0.9.5/plexus-java-0.9.5.jar
> (32 kB at 312 kB/s)
> [INFO] Downloaded from central:
> https://repo.maven.apache.org/maven2/org/apache/httpcomponents/httpclient/4.5.2/httpclient-4.5.2.jar
> (737 kB at 7.0 MB/s)
> [INFO] Downloaded from central:
> https://repo.maven.apache.org/maven2/org/apache/httpcomponents/httpcore/4.4.4/httpcore-4.4.4.jar
> (327 kB at 3.0 MB/s)
> [INFO] Downloaded from central:
> https://repo.maven.apache.org/maven2/org/ow2/asm/asm/6.0/asm-6.0.jar (95 kB
> at 787 kB/s)
> [JENKINS] Archiving  javadoc
> [WARNING] Attempt to (de-)serialize anonymous class hudson.FilePath$32;
> see: https://jenkins.io/redirect/serialization-of-anonymous-classes/
> [INFO]
> [INFO] --- maven-javadoc-plugin:3.0.0:jar (create-javadoc-jar) @
> commons-csv ---
> [INFO] Building jar: <
> https://builds.apache.org/job/commons-csv/ws/target/commons-csv-1.6-SNAPSHOT-javadoc.jar
>>
> [INFO]
> [INFO] >>> maven-source-plugin:3.0.1:jar (create-source-jar) >
> generate-sources @ commons-csv >>>
> [INFO]
> [INFO] --- maven-enforcer-plugin:1.4.1:enforce (enforce-maven-3) @
> commons-csv ---
> [INFO]
> [INFO] --- build-helper-maven-plugin:3.0.0:parse-version (parse-version) @
> commons-csv ---
> [INFO]
> [INFO] --- maven-antrun-plugin:1.8:run (javadoc.resources) @ commons-csv ---
> [INFO] Executing tasks
>
> main:
> [INFO] Executed tasks
> [WARNING] Failed to getClass for
> org.apache.maven.plugins.source.SourceJarMojo
> [INFO]
> [INFO] <<< maven-source-plugin:3.0.1:jar (create-source-jar) <
> generate-sources @ commons-csv <<<
> [INFO]
> [INFO]
> [INFO] --- maven-source-plugin:3.0.1:jar (create-source-jar) @ commons-csv
> ---
> [INFO] Building jar: <
> https://builds.apache.org/job/commons-csv/ws/target/commons-csv-1.6-SNAPSHOT-sources.jar
>>
> [INFO]
> [INFO] >>> maven-source-plugin:3.0.1:test-jar (create-source-jar) >
> generate-sources @ commons-csv >>>
> [INFO]
> [INFO] --- maven-enforcer-plugin:1.4.1:enforce (enforce-maven-3) @
> commons-csv ---
> [INFO]
> [INFO] --- build-helper-maven-plugin:3.0.0:parse-version (parse-version) @
> commons-csv ---
> [INFO]
> [INFO] --- maven-antrun-plugin:1.8:run (javadoc.resources) @ commons-csv ---
> [INFO] Executing tasks
>
> main:
> [INFO] Executed tasks
> [WARNING] Failed to getClass for
> org.apache.maven.plugins.source.TestSourceJarMojo
> [INFO]
> [INFO] <<< maven-source-plugin:3.0.1:test-jar (create-source-jar) <
> generate-sources @ commons-csv <<<
> [INFO]
> [INFO]
> [INFO] --- maven-source-plugin:3.0.1:test-jar (create-source-jar) @
> commons-csv ---
> [INFO] Building jar: <
> https://builds.apache.org/job/commons-csv/ws/target/commons-csv-1.6-SNAPSHOT-test-sources.jar
>>
> [INFO]
> [INFO] --- maven-jar-plugin:3.0.0:test-jar (default) @ commons-csv ---
> [INFO] Building jar: <
> https://builds.apache.org/job/commons-csv/ws/target/commons-csv-1.6-SNAPSHOT-tests.jar
>>
> [INFO]
> [INFO] --- maven-assembly-plugin:2.6:single (default) @ commons-csv ---
> [INFO] Downloading from central:
> https://repo.maven.apache.org/maven2/org/codehaus/plexus/plexus-archiver/3.0.1/plexus-archiver-3.0.1.pom
> [INFO] Downloaded from central:
> https://repo.maven.apache.org/maven2/org/codehaus/plexus/plexus-archiver/3.0.1/plexus-archiver-3.0.1.pom
> (5.8 kB at 214 kB/s)
> [INFO] Downloading from central:
> https://repo.maven.apache.org/maven2/org/codehaus/plexus/plexus-io/2.6/plexus-io-2.6.pom
> [INFO] Downloaded from central:
> https://repo.maven.apache.org/maven2/org/codehaus/plexus/plexus-io/2.6/plexus-io-2.6.pom
> (3.9 kB at 164 kB/s)
> [INFO] Downloading from central:
> https://repo.maven.apache.org/maven2/org/iq80/snappy/snappy/0.3/snappy-0.3.pom
> [INFO] Downloaded from central:
> https://repo.maven.apache.org/maven2/org/iq80/snappy/snappy/0.3/snappy-0.3.pom
> (14 kB at 600 kB/s)
> [INFO] Downloading from central:
> https://repo.maven.apache.org/maven2/org/apache/maven/shared/file-management/1.1/file-management-1.1.pom
> [INFO] Downloaded from central:
> https://repo.maven.apache.org/maven2/org/apache/maven/shared/file-management/1.1/file-management-1.1.pom
> (2.7 kB at 111 kB/s)
> [INFO] Downloading from central:
> https://repo.maven.apache.org/maven2/org/apache/maven/shared/maven-shared-components/4/maven-shared-components-4.pom
> [INFO] Downloaded from central:
> https://repo.maven.apache.org/maven2/org/apache/maven/shared/maven-shared-components/4/maven-shared-components-4.pom
> (2.2 kB at 92 kB/s)
> [INFO] Downloading from central:
> https://repo.maven.apache.org/maven2/org/apache/maven/shared/maven-shared-io/1.0/maven-shared-io-1.0.pom
> [INFO] Downloaded from central:
> https://repo.maven.apache.org/maven2/org/apache/maven/shared/maven-shared-io/1.0/maven-shared-io-1.0.pom
> (3.0 kB at 126 kB/s)
> [INFO] Downloading from central:
> https://repo.maven.apache.org/maven2/org/apache/maven/shared/maven-filtering/1.3/maven-filtering-1.3.pom
> [INFO] Downloaded from central:
> https://repo.maven.apache.org/maven2/org/apache/maven/shared/maven-filtering/1.3/maven-filtering-1.3.pom
> (6.2 kB at 258 kB/s)
> [INFO] Downloading from central:
> https://repo.maven.apache.org/maven2/org/codehaus/plexus/plexus-utils/3.0.18/plexus-utils-3.0.18.pom
> [INFO] Downloaded from central:
> https://repo.maven.apache.org/maven2/org/codehaus/plexus/plexus-utils/3.0.18/plexus-utils-3.0.18.pom
> (3.4 kB at 141 kB/s)
> [INFO] Downloading from central:
> https://repo.maven.apache.org/maven2/org/apache/maven/shared/maven-repository-builder/1.0/maven-repository-builder-1.0.pom
> [INFO] Downloaded from central:
> https://repo.maven.apache.org/maven2/org/apache/maven/shared/maven-repository-builder/1.0/maven-repository-builder-1.0.pom
> (4.6 kB at 190 kB/s)
> [INFO] Downloading from central:
> https://repo.maven.apache.org/maven2/org/apache/maven/maven-artifact/2.0.4/maven-artifact-2.0.4.pom
> [INFO] Downloaded from central:
> https://repo.maven.apache.org/maven2/org/apache/maven/maven-artifact/2.0.4/maven-artifact-2.0.4.pom
> (765 B at 33 kB/s)
> [INFO] Downloading from central:
> https://repo.maven.apache.org/maven2/org/apache/maven/maven/2.0.4/maven-2.0.4.pom
> [INFO] Downloaded from central:
> https://repo.maven.apache.org/maven2/org/apache/maven/maven/2.0.4/maven-2.0.4.pom
> (12 kB at 491 kB/s)
> [INFO] Downloading from central:
> https://repo.maven.apache.org/maven2/org/apache/maven/maven-artifact-manager/2.0.4/maven-artifact-manager-2.0.4.pom
> [INFO] Downloaded from central:
> https://repo.maven.apache.org/maven2/org/apache/maven/maven-artifact-manager/2.0.4/maven-artifact-manager-2.0.4.pom
> (1.4 kB at 59 kB/s)
> [INFO] Downloading from central:
> https://repo.maven.apache.org/maven2/org/apache/maven/maven-repository-metadata/2.0.4/maven-repository-metadata-2.0.4.pom
> [INFO] Downloaded from central:
> https://repo.maven.apache.org/maven2/org/apache/maven/maven-repository-metadata/2.0.4/maven-repository-metadata-2.0.4.pom
> (1.5 kB at 65 kB/s)
> [INFO] Downloading from central:
> https://repo.maven.apache.org/maven2/org/apache/maven/maven-project/2.0.4/maven-project-2.0.4.pom
> [INFO] Downloaded from central:
> https://repo.maven.apache.org/maven2/org/apache/maven/maven-project/2.0.4/maven-project-2.0.4.pom
> (1.8 kB at 77 kB/s)
> [INFO] Downloading from central:
> https://repo.maven.apache.org/maven2/org/apache/maven/maven-settings/2.0.4/maven-settings-2.0.4.pom
> [INFO] Downloaded from central:
> https://repo.maven.apache.org/maven2/org/apache/maven/maven-settings/2.0.4/maven-settings-2.0.4.pom
> (1.6 kB at 71 kB/s)
> [INFO] Downloading from central:
> https://repo.maven.apache.org/maven2/org/apache/maven/maven-model/2.0.4/maven-model-2.0.4.pom
> [INFO] Downloaded from central:
> https://repo.maven.apache.org/maven2/org/apache/maven/maven-model/2.0.4/maven-model-2.0.4.pom
> (2.7 kB at 118 kB/s)
> [INFO] Downloading from central:
> https://repo.maven.apache.org/maven2/org/apache/maven/maven-profile/2.0.4/maven-profile-2.0.4.pom
> [INFO] Downloaded from central:
> https://repo.maven.apache.org/maven2/org/apache/maven/maven-profile/2.0.4/maven-profile-2.0.4.pom
> (1.6 kB at 70 kB/s)
> [INFO] Downloading from central:
> https://repo.maven.apache.org/maven2/org/codehaus/plexus/plexus-interpolation/1.22/plexus-interpolation-1.22.jar
> [INFO] Downloading from central:
> https://repo.maven.apache.org/maven2/org/codehaus/plexus/plexus-archiver/3.0.1/plexus-archiver-3.0.1.jar
> [INFO] Downloading from central:
> https://repo.maven.apache.org/maven2/org/iq80/snappy/snappy/0.3/snappy-0.3.jar
> [INFO] Downloading from central:
> https://repo.maven.apache.org/maven2/org/apache/maven/shared/file-management/1.1/file-management-1.1.jar
> [INFO] Downloading from central:
> https://repo.maven.apache.org/maven2/org/apache/maven/shared/maven-filtering/1.3/maven-filtering-1.3.jar
> [INFO] Downloaded from central:
> https://repo.maven.apache.org/maven2/org/codehaus/plexus/plexus-interpolation/1.22/plexus-interpolation-1.22.jar
> (77 kB at 2.8 MB/s)
> [INFO] Downloading from central:
> https://repo.maven.apache.org/maven2/org/codehaus/plexus/plexus-io/2.6/plexus-io-2.6.jar
> [INFO] Downloaded from central:
> https://repo.maven.apache.org/maven2/org/apache/maven/shared/file-management/1.1/file-management-1.1.jar
> (31 kB at 1.1 MB/s)
> [INFO] Downloading from central:
> https://repo.maven.apache.org/maven2/org/apache/maven/shared/maven-repository-builder/1.0/maven-repository-builder-1.0.jar
> [INFO] Downloaded from central:
> https://repo.maven.apache.org/maven2/org/iq80/snappy/snappy/0.3/snappy-0.3.jar
> (49 kB at 1.6 MB/s)
> [INFO] Downloaded from central:
> https://repo.maven.apache.org/maven2/org/apache/maven/shared/maven-filtering/1.3/maven-filtering-1.3.jar
> (51 kB at 1.7 MB/s)
> [INFO] Downloaded from central:
> https://repo.maven.apache.org/maven2/org/codehaus/plexus/plexus-archiver/3.0.1/plexus-archiver-3.0.1.jar
> (381 kB at 8.9 MB/s)
> [INFO] Downloaded from central:
> https://repo.maven.apache.org/maven2/org/codehaus/plexus/plexus-io/2.6/plexus-io-2.6.jar
> (84 kB at 1.7 MB/s)
> [INFO] Downloaded from central:
> https://repo.maven.apache.org/maven2/org/apache/maven/shared/maven-repository-builder/1.0/maven-repository-builder-1.0.jar
> (22 kB at 425 kB/s)
> [INFO] Reading assembly descriptor: src/assembly/bin.xml
> [INFO] Reading assembly descriptor: src/assembly/src.xml
> [INFO] Building tar: <
> https://builds.apache.org/job/commons-csv/ws/target/commons-csv-1.6-SNAPSHOT-bin.tar.gz
>>
> [INFO] Building zip: <
> https://builds.apache.org/job/commons-csv/ws/target/commons-csv-1.6-SNAPSHOT-bin.zip
>>
> [INFO] Building tar: <
> https://builds.apache.org/job/commons-csv/ws/target/commons-csv-1.6-SNAPSHOT-src.tar.gz
>>
> [INFO] Building zip: <
> https://builds.apache.org/job/commons-csv/ws/target/commons-csv-1.6-SNAPSHOT-src.zip
>>
> [INFO]
> [INFO] --- maven-gpg-plugin:1.6:sign (sign-artifacts) @ commons-csv ---
> [INFO]
> [INFO] --- jacoco-maven-plugin:0.7.9:check (check) @ commons-csv ---
> [INFO] Loading execution data file <
> https://builds.apache.org/job/commons-csv/ws/target/jacoco.exec>
> [INFO] Analyzed bundle 'commons-csv' with 15 classes
> [INFO] All coverage checks have been met.
> [INFO]
> [INFO] --- maven-install-plugin:2.5.2:install (default-install) @
> commons-csv ---
> [INFO] Installing <
> https://builds.apache.org/job/commons-csv/ws/target/commons-csv-1.6-SNAPSHOT.jar>
> to
> /home/jenkins/jenkins-slave/maven-repositories/1/org/apache/commons/commons-csv/1.6-SNAPSHOT/commons-csv-1.6-SNAPSHOT.jar
> [INFO] Installing <https://builds.apache.org/job/commons-csv/ws/pom.xml> to
> /home/jenkins/jenkins-slave/maven-repositories/1/org/apache/commons/commons-csv/1.6-SNAPSHOT/commons-csv-1.6-SNAPSHOT.pom
> [INFO] Installing <
> https://builds.apache.org/job/commons-csv/ws/target/commons-csv-1.6-SNAPSHOT-javadoc.jar>
> to
> /home/jenkins/jenkins-slave/maven-repositories/1/org/apache/commons/commons-csv/1.6-SNAPSHOT/commons-csv-1.6-SNAPSHOT-javadoc.jar
> [INFO] Installing <
> https://builds.apache.org/job/commons-csv/ws/target/commons-csv-1.6-SNAPSHOT-sources.jar>
> to
> /home/jenkins/jenkins-slave/maven-repositories/1/org/apache/commons/commons-csv/1.6-SNAPSHOT/commons-csv-1.6-SNAPSHOT-sources.jar
> [INFO] Installing <
> https://builds.apache.org/job/commons-csv/ws/target/commons-csv-1.6-SNAPSHOT-test-sources.jar>
> to
> /home/jenkins/jenkins-slave/maven-repositories/1/org/apache/commons/commons-csv/1.6-SNAPSHOT/commons-csv-1.6-SNAPSHOT-test-sources.jar
> [INFO] Installing <
> https://builds.apache.org/job/commons-csv/ws/target/commons-csv-1.6-SNAPSHOT-tests.jar>
> to
> /home/jenkins/jenkins-slave/maven-repositories/1/org/apache/commons/commons-csv/1.6-SNAPSHOT/commons-csv-1.6-SNAPSHOT-tests.jar
> [INFO] Installing <
> https://builds.apache.org/job/commons-csv/ws/target/commons-csv-1.6-SNAPSHOT-bin.tar.gz>
> to
> /home/jenkins/jenkins-slave/maven-repositories/1/org/apache/commons/commons-csv/1.6-SNAPSHOT/commons-csv-1.6-SNAPSHOT-bin.tar.gz
> [INFO] Installing <
> https://builds.apache.org/job/commons-csv/ws/target/commons-csv-1.6-SNAPSHOT-bin.zip>
> to
> /home/jenkins/jenkins-slave/maven-repositories/1/org/apache/commons/commons-csv/1.6-SNAPSHOT/commons-csv-1.6-SNAPSHOT-bin.zip
> [INFO] Installing <
> https://builds.apache.org/job/commons-csv/ws/target/commons-csv-1.6-SNAPSHOT-src.tar.gz>
> to
> /home/jenkins/jenkins-slave/maven-repositories/1/org/apache/commons/commons-csv/1.6-SNAPSHOT/commons-csv-1.6-SNAPSHOT-src.tar.gz
> [INFO] Installing <
> https://builds.apache.org/job/commons-csv/ws/target/commons-csv-1.6-SNAPSHOT-src.zip>
> to
> /home/jenkins/jenkins-slave/maven-repositories/1/org/apache/commons/commons-csv/1.6-SNAPSHOT/commons-csv-1.6-SNAPSHOT-src.zip
> [WARNING] Attempt to (de-)serialize anonymous class
> hudson.maven.reporters.MavenArtifactArchiver$2; see:
> https://jenkins.io/redirect/serialization-of-anonymous-classes/
> [WARNING] Attempt to (de-)serialize anonymous class
> hudson.maven.reporters.MavenFingerprinter$1; see:
> https://jenkins.io/redirect/serialization-of-anonymous-classes/
> [INFO]
> ------------------------------------------------------------------------
> [INFO] BUILD SUCCESS
> [INFO]
> ------------------------------------------------------------------------
> [INFO] Total time: 01:51 min
> [INFO] Finished at: 2018-08-20T06:49:51Z
> [INFO] Final Memory: 60M/3925M
> [INFO]
> ------------------------------------------------------------------------
> Waiting for Jenkins to finish collecting data
> [JENKINS] Archiving <https://builds.apache.org/job/commons-csv/ws/pom.xml>
> to org.apache.commons/commons-csv/1.6-SNAPSHOT/commons-csv-1.6-SNAPSHOT.pom
> [JENKINS] Archiving <
> https://builds.apache.org/job/commons-csv/ws/target/commons-csv-1.6-SNAPSHOT.jar>
> to org.apache.commons/commons-csv/1.6-SNAPSHOT/commons-csv-1.6-SNAPSHOT.jar
> [JENKINS] Archiving <
> https://builds.apache.org/job/commons-csv/ws/target/commons-csv-1.6-SNAPSHOT-javadoc.jar>
> to
> org.apache.commons/commons-csv/1.6-SNAPSHOT/commons-csv-1.6-SNAPSHOT-javadoc.jar
> [JENKINS] Archiving <
> https://builds.apache.org/job/commons-csv/ws/target/commons-csv-1.6-SNAPSHOT-sources.jar>
> to
> org.apache.commons/commons-csv/1.6-SNAPSHOT/commons-csv-1.6-SNAPSHOT-sources.jar
> [JENKINS] Archiving <
> https://builds.apache.org/job/commons-csv/ws/target/commons-csv-1.6-SNAPSHOT-test-sources.jar>
> to
> org.apache.commons/commons-csv/1.6-SNAPSHOT/commons-csv-1.6-SNAPSHOT-test-sources.jar
> [JENKINS] Archiving <
> https://builds.apache.org/job/commons-csv/ws/target/commons-csv-1.6-SNAPSHOT-tests.jar>
> to
> org.apache.commons/commons-csv/1.6-SNAPSHOT/commons-csv-1.6-SNAPSHOT-tests.jar
> [JENKINS] Archiving <
> https://builds.apache.org/job/commons-csv/ws/target/commons-csv-1.6-SNAPSHOT-bin.tar.gz>
> to
> org.apache.commons/commons-csv/1.6-SNAPSHOT/commons-csv-1.6-SNAPSHOT-bin.tar.gz
> [JENKINS] Archiving <
> https://builds.apache.org/job/commons-csv/ws/target/commons-csv-1.6-SNAPSHOT-bin.zip>
> to
> org.apache.commons/commons-csv/1.6-SNAPSHOT/commons-csv-1.6-SNAPSHOT-bin.zip
> [JENKINS] Archiving <
> https://builds.apache.org/job/commons-csv/ws/target/commons-csv-1.6-SNAPSHOT-src.tar.gz>
> to
> org.apache.commons/commons-csv/1.6-SNAPSHOT/commons-csv-1.6-SNAPSHOT-src.tar.gz
> [JENKINS] Archiving <
> https://builds.apache.org/job/commons-csv/ws/target/commons-csv-1.6-SNAPSHOT-src.zip>
> to
> org.apache.commons/commons-csv/1.6-SNAPSHOT/commons-csv-1.6-SNAPSHOT-src.zip
> [Fast Archiver] Compressed 141.28 MB of artifacts by 74.4% relative to #87
> channel stopped
> Maven RedeployPublisher use remote beam2 maven settings from :
> /home/jenkins/.m2/settings.xml
> [INFO] Deployment in
> https://repository.apache.org/content/repositories/snapshots
> (id=apache.snapshots.https,uniqueVersion=true)
> Deploying the main artifact commons-csv-1.6-SNAPSHOT.jar
> Downloading:
> https://repository.apache.org/content/repositories/snapshots/org/apache/commons/commons-csv/1.6-SNAPSHOT/maven-metadata.xml
> Downloaded:
> https://repository.apache.org/content/repositories/snapshots/org/apache/commons/commons-csv/1.6-SNAPSHOT/maven-metadata.xml
> (3 KB at 2.6 KB/sec)
> Uploading:
> https://repository.apache.org/content/repositories/snapshots/org/apache/commons/commons-csv/1.6-SNAPSHOT/commons-csv-1.6-20180820.065008-25.jar
> Uploading:
> https://repository.apache.org/content/repositories/snapshots/org/apache/commons/commons-csv/1.6-SNAPSHOT/commons-csv-1.6-20180820.065008-25.pom
> ERROR: Failed to deploy artifacts: Could not transfer artifact
> org.apache.commons:commons-csv:jar:1.6-20180820.065008-25 from/to
> apache.snapshots.https (
> https://repository.apache.org/content/repositories/snapshots): Failed to
> transfer file:
> https://repository.apache.org/content/repositories/snapshots/org/apache/commons/commons-csv/1.6-SNAPSHOT/commons-csv-1.6-20180820.065008-25.jar.
> Return code is: 401, ReasonPhrase: Unauthorized.
> org.apache.maven.artifact.deployer.ArtifactDeploymentException: Failed to
> deploy artifacts: Could not transfer artifact
> org.apache.commons:commons-csv:jar:1.6-20180820.065008-25 from/to
> apache.snapshots.https (
> https://repository.apache.org/content/repositories/snapshots): Failed to
> transfer file:
> https://repository.apache.org/content/repositories/snapshots/org/apache/commons/commons-csv/1.6-SNAPSHOT/commons-csv-1.6-20180820.065008-25.jar.
> Return code is: 401, ReasonPhrase: Unauthorized.
>         at
> org.apache.maven.artifact.deployer.DefaultArtifactDeployer.deploy(DefaultArtifactDeployer.java:143)
>         at
> hudson.maven.reporters.MavenArtifactRecord.deploy(MavenArtifactRecord.java:193)
>         at
> hudson.maven.RedeployPublisher.perform(RedeployPublisher.java:176)
>         at hudson.tasks.BuildStepMonitor$1.perform(BuildStepMonitor.java:20)
>         at
> hudson.model.AbstractBuild$AbstractBuildExecution.perform(AbstractBuild.java:744)
>         at
> hudson.model.AbstractBuild$AbstractBuildExecution.performAllBuildSteps(AbstractBuild.java:690)
>         at
> hudson.maven.MavenModuleSetBuild$MavenModuleSetBuildExecution.post2(MavenModuleSetBuild.java:1073)
>         at
> hudson.model.AbstractBuild$AbstractBuildExecution.post(AbstractBuild.java:635)
>         at hudson.model.Run.execute(Run.java:1819)
>         at
> hudson.maven.MavenModuleSetBuild.run(MavenModuleSetBuild.java:543)
>         at
> hudson.model.ResourceController.execute(ResourceController.java:97)
>         at hudson.model.Executor.run(Executor.java:429)
> Caused by: org.eclipse.aether.deployment.DeploymentException: Failed to
> deploy artifacts: Could not transfer artifact
> org.apache.commons:commons-csv:jar:1.6-20180820.065008-25 from/to
> apache.snapshots.https (
> https://repository.apache.org/content/repositories/snapshots): Failed to
> transfer file:
> https://repository.apache.org/content/repositories/snapshots/org/apache/commons/commons-csv/1.6-SNAPSHOT/commons-csv-1.6-20180820.065008-25.jar.
> Return code is: 401, ReasonPhrase: Unauthorized.
>         at
> org.eclipse.aether.internal.impl.DefaultDeployer.deploy(DefaultDeployer.java:317)
>         at
> org.eclipse.aether.internal.impl.DefaultDeployer.deploy(DefaultDeployer.java:245)
>         at
> org.eclipse.aether.internal.impl.DefaultRepositorySystem.deploy(DefaultRepositorySystem.java:420)
>         at
> org.apache.maven.artifact.deployer.DefaultArtifactDeployer.deploy(DefaultArtifactDeployer.java:139)
>         ... 11 more
> Caused by: org.eclipse.aether.transfer.ArtifactTransferException: Could not
> transfer artifact org.apache.commons:commons-csv:jar:1.6-20180820.065008-25
> from/to apache.snapshots.https (
> https://repository.apache.org/content/repositories/snapshots): Failed to
> transfer file:
> https://repository.apache.org/content/repositories/snapshots/org/apache/commons/commons-csv/1.6-SNAPSHOT/commons-csv-1.6-20180820.065008-25.jar.
> Return code is: 401, ReasonPhrase: Unauthorized.
>         at
> org.eclipse.aether.connector.basic.ArtifactTransportListener.transferFailed(ArtifactTransportListener.java:43)
>         at
> org.eclipse.aether.connector.basic.BasicRepositoryConnector$TaskRunner.run(BasicRepositoryConnector.java:355)
>         at
> org.eclipse.aether.connector.basic.BasicRepositoryConnector.put(BasicRepositoryConnector.java:274)
>         at
> org.eclipse.aether.internal.impl.DefaultDeployer.deploy(DefaultDeployer.java:311)
>         ... 14 more
> Caused by: org.apache.maven.wagon.TransferFailedException: Failed to
> transfer file:
> https://repository.apache.org/content/repositories/snapshots/org/apache/commons/commons-csv/1.6-SNAPSHOT/commons-csv-1.6-20180820.065008-25.jar.
> Return code is: 401, ReasonPhrase: Unauthorized.
>         at
> org.apache.maven.wagon.shared.http.AbstractHttpClientWagon.put(AbstractHttpClientWagon.java:635)
>         at
> org.apache.maven.wagon.shared.http.AbstractHttpClientWagon.put(AbstractHttpClientWagon.java:557)
>         at
> org.apache.maven.wagon.shared.http.AbstractHttpClientWagon.put(AbstractHttpClientWagon.java:539)
>         at
> org.apache.maven.wagon.shared.http.AbstractHttpClientWagon.put(AbstractHttpClientWagon.java:533)
>         at
> org.apache.maven.wagon.shared.http.AbstractHttpClientWagon.put(AbstractHttpClientWagon.java:513)
>         at
> org.eclipse.aether.transport.wagon.WagonTransporter$PutTaskRunner.run(WagonTransporter.java:644)
>         at
> org.eclipse.aether.transport.wagon.WagonTransporter.execute(WagonTransporter.java:427)
>         at
> org.eclipse.aether.transport.wagon.WagonTransporter.put(WagonTransporter.java:410)
>         at
> org.eclipse.aether.connector.basic.BasicRepositoryConnector$PutTaskRunner.runTask(BasicRepositoryConnector.java:510)
>         at
> org.eclipse.aether.connector.basic.BasicRepositoryConnector$TaskRunner.run(BasicRepositoryConnector.java:350)
>         ... 16 more
> [INFO] Deployment failed after 2.7 sec
> Build step 'Deploy artifacts to Maven repository' changed build result to
> FAILURE

---------------------------------------------------------------------
To unsubscribe, e-mail: [hidden email]
For additional commands, e-mail: [hidden email]

Reply | Threaded
Open this post in threaded view
|

Re: Build failed in Jenkins: commons-csv #88

Benedikt Ritter-4
Am Mi., 22. Aug. 2018 um 19:15 Uhr schrieb sebb <[hidden email]>:

> I discovered yesterday that not all of the beam* nodes are set up with
> creds for deploying snapshots:
>
> https://issues.apache.org/jira/browse/INFRA-16935
>
> Unless otherwise advised, jobs should be set up to run on ubuntu nodes.
>
> This means ensuring that you enable:
>   "Restrict where this project can be run"
> and enter the word: ubuntu
>
> I've done this for CSV which has just completed OK.
>

Thank you very much!


>
> On 20 August 2018 at 17:53, Benedikt Ritter <[hidden email]> wrote:
> > These failures don't seem to be related to my changes. Any idea how to
> fix
> > this?
> >
> > ---------- Forwarded message ---------
> > From: Apache Jenkins Server <[hidden email]>
> > Date: Mo., 20. Aug. 2018 um 08:50 Uhr
> > Subject: Build failed in Jenkins: commons-csv #88
> > To: <[hidden email]>
> >
> >
> > See <
> >
> https://builds.apache.org/job/commons-csv/88/display/redirect?page=changes
> >
> >
> > Changes:
> >
> > [britter] Add missing predefined formats to class documentation
> >
> > ------------------------------------------
> > [...truncated 155.25 KB...]
> > [INFO] Downloaded from central:
> >
> https://repo.maven.apache.org/maven2/org/apache/httpcomponents/httpcore/4.4.4/httpcore-4.4.4.pom
> > (5.5 kB at 240 kB/s)
> > [INFO] Downloading from central:
> >
> https://repo.maven.apache.org/maven2/org/apache/httpcomponents/httpcomponents-core/4.4.4/httpcomponents-core-4.4.4.pom
> > [INFO] Downloaded from central:
> >
> https://repo.maven.apache.org/maven2/org/apache/httpcomponents/httpcomponents-core/4.4.4/httpcomponents-core-4.4.4.pom
> > (13 kB at 537 kB/s)
> > [INFO] Downloading from central:
> >
> https://repo.maven.apache.org/maven2/commons-codec/commons-codec/1.9/commons-codec-1.9.pom
> > [INFO] Downloaded from central:
> >
> https://repo.maven.apache.org/maven2/commons-codec/commons-codec/1.9/commons-codec-1.9.pom
> > (12 kB at 481 kB/s)
> > [INFO] Downloading from central:
> >
> https://repo.maven.apache.org/maven2/org/apache/commons/commons-parent/32/commons-parent-32.pom
> > [INFO] Downloaded from central:
> >
> https://repo.maven.apache.org/maven2/org/apache/commons/commons-parent/32/commons-parent-32.pom
> > (53 kB at 2.1 MB/s)
> > [INFO] Downloading from central:
> >
> https://repo.maven.apache.org/maven2/org/codehaus/plexus/plexus-java/0.9.5/plexus-java-0.9.5.pom
> > [INFO] Downloaded from central:
> >
> https://repo.maven.apache.org/maven2/org/codehaus/plexus/plexus-java/0.9.5/plexus-java-0.9.5.pom
> > (2.4 kB at 97 kB/s)
> > [INFO] Downloading from central:
> >
> https://repo.maven.apache.org/maven2/org/codehaus/plexus/plexus-languages/0.9.5/plexus-languages-0.9.5.pom
> > [INFO] Downloaded from central:
> >
> https://repo.maven.apache.org/maven2/org/codehaus/plexus/plexus-languages/0.9.5/plexus-languages-0.9.5.pom
> > (2.3 kB at 95 kB/s)
> > [INFO] Downloading from central:
> > https://repo.maven.apache.org/maven2/org/ow2/asm/asm/6.0/asm-6.0.pom
> > [INFO] Downloaded from central:
> > https://repo.maven.apache.org/maven2/org/ow2/asm/asm/6.0/asm-6.0.pom
> (1.9
> > kB at 84 kB/s)
> > [INFO] Downloading from central:
> >
> https://repo.maven.apache.org/maven2/org/ow2/asm/asm-parent/6.0/asm-parent-6.0.pom
> > [INFO] Downloaded from central:
> >
> https://repo.maven.apache.org/maven2/org/ow2/asm/asm-parent/6.0/asm-parent-6.0.pom
> > (5.5 kB at 229 kB/s)
> > [INFO] Downloading from central:
> >
> https://repo.maven.apache.org/maven2/org/codehaus/plexus/plexus-container-default/1.0-alpha-7/plexus-container-default-1.0-alpha-7.pom
> > [INFO] Downloaded from central:
> >
> https://repo.maven.apache.org/maven2/org/codehaus/plexus/plexus-container-default/1.0-alpha-7/plexus-container-default-1.0-alpha-7.pom
> > (1.3 kB at 56 kB/s)
> > [INFO] Downloading from central:
> >
> https://repo.maven.apache.org/maven2/plexus/plexus-containers/1.0.2/plexus-containers-1.0.2.pom
> > [INFO] Downloaded from central:
> >
> https://repo.maven.apache.org/maven2/plexus/plexus-containers/1.0.2/plexus-containers-1.0.2.pom
> > (471 B at 20 kB/s)
> > [INFO] Downloading from central:
> >
> https://repo.maven.apache.org/maven2/plexus/plexus-root/1.0.3/plexus-root-1.0.3.pom
> > [INFO] Downloaded from central:
> >
> https://repo.maven.apache.org/maven2/plexus/plexus-root/1.0.3/plexus-root-1.0.3.pom
> > (6.0 kB at 262 kB/s)
> > [INFO] Downloading from central:
> >
> https://repo.maven.apache.org/maven2/org/apache/maven/shared/maven-shared-utils/3.0.1/maven-shared-utils-3.0.1.jar
> > [INFO] Downloading from central:
> >
> https://repo.maven.apache.org/maven2/org/apache/maven/shared/maven-invoker/2.2/maven-invoker-2.2.jar
> > [INFO] Downloading from central:
> >
> https://repo.maven.apache.org/maven2/org/apache/maven/shared/maven-common-artifact-filters/3.0.0/maven-common-artifact-filters-3.0.0.jar
> > [INFO] Downloading from central:
> >
> https://repo.maven.apache.org/maven2/org/apache/maven/shared/maven-artifact-transfer/0.9.1/maven-artifact-transfer-0.9.1.jar
> > [INFO] Downloading from central:
> >
> https://repo.maven.apache.org/maven2/org/slf4j/slf4j-api/1.7.5/slf4j-api-1.7.5.jar
> > [INFO] Downloaded from central:
> >
> https://repo.maven.apache.org/maven2/org/apache/maven/shared/maven-invoker/2.2/maven-invoker-2.2.jar
> > (30 kB at 1.1 MB/s)
> > [INFO] Downloading from central:
> >
> https://repo.maven.apache.org/maven2/org/apache/maven/doxia/doxia-sink-api/1.7/doxia-sink-api-1.7.jar
> > [INFO] Downloaded from central:
> >
> https://repo.maven.apache.org/maven2/org/apache/maven/shared/maven-shared-utils/3.0.1/maven-shared-utils-3.0.1.jar
> > (154 kB at 5.1 MB/s)
> > [INFO] Downloading from central:
> >
> https://repo.maven.apache.org/maven2/org/apache/maven/doxia/doxia-logging-api/1.7/doxia-logging-api-1.7.jar
> > [INFO] Downloaded from central:
> >
> https://repo.maven.apache.org/maven2/org/apache/maven/shared/maven-artifact-transfer/0.9.1/maven-artifact-transfer-0.9.1.jar
> > (123 kB at 4.1 MB/s)
> > [INFO] Downloading from central:
> >
> https://repo.maven.apache.org/maven2/org/apache/maven/doxia/doxia-site-renderer/1.7.4/doxia-site-renderer-1.7.4.jar
> > [INFO] Downloaded from central:
> >
> https://repo.maven.apache.org/maven2/org/slf4j/slf4j-api/1.7.5/slf4j-api-1.7.5.jar
> > (26 kB at 869 kB/s)
> > [INFO] Downloaded from central:
> >
> https://repo.maven.apache.org/maven2/org/apache/maven/shared/maven-common-artifact-filters/3.0.0/maven-common-artifact-filters-3.0.0.jar
> > (57 kB at 1.8 MB/s)
> > [INFO] Downloading from central:
> >
> https://repo.maven.apache.org/maven2/org/apache/maven/doxia/doxia-core/1.7/doxia-core-1.7.jar
> > [INFO] Downloading from central:
> > https://repo.maven.apache.org/maven2/xmlunit/xmlunit/1.5/xmlunit-1.5.jar
> > [INFO] Downloaded from central:
> >
> https://repo.maven.apache.org/maven2/org/apache/maven/doxia/doxia-sink-api/1.7/doxia-sink-api-1.7.jar
> > (11 kB at 233 kB/s)
> > [INFO] Downloading from central:
> >
> https://repo.maven.apache.org/maven2/org/apache/maven/doxia/doxia-decoration-model/1.7.4/doxia-decoration-model-1.7.4.jar
> > [INFO] Downloaded from central:
> >
> https://repo.maven.apache.org/maven2/org/apache/maven/doxia/doxia-logging-api/1.7/doxia-logging-api-1.7.jar
> > (12 kB at 227 kB/s)
> > [INFO] Downloading from central:
> >
> https://repo.maven.apache.org/maven2/org/apache/maven/doxia/doxia-skin-model/1.7.4/doxia-skin-model-1.7.4.jar
> > [INFO] Downloaded from central:
> >
> https://repo.maven.apache.org/maven2/org/apache/maven/doxia/doxia-site-renderer/1.7.4/doxia-site-renderer-1.7.4.jar
> > (64 kB at 1.2 MB/s)
> > [INFO] Downloading from central:
> >
> https://repo.maven.apache.org/maven2/org/apache/maven/doxia/doxia-module-xhtml/1.7/doxia-module-xhtml-1.7.jar
> > [INFO] Downloaded from central:
> > https://repo.maven.apache.org/maven2/xmlunit/xmlunit/1.5/xmlunit-1.5.jar
> > (98 kB at 1.8 MB/s)
> > [INFO] Downloading from central:
> >
> https://repo.maven.apache.org/maven2/org/apache/commons/commons-lang3/3.5/commons-lang3-3.5.jar
> > [INFO] Downloaded from central:
> >
> https://repo.maven.apache.org/maven2/org/apache/maven/doxia/doxia-core/1.7/doxia-core-1.7.jar
> > (167 kB at 2.9 MB/s)
> > [INFO] Downloading from central:
> >
> https://repo.maven.apache.org/maven2/org/apache/httpcomponents/httpclient/4.5.2/httpclient-4.5.2.jar
> > [INFO] Downloaded from central:
> >
> https://repo.maven.apache.org/maven2/org/apache/maven/doxia/doxia-decoration-model/1.7.4/doxia-decoration-model-1.7.4.jar
> > (61 kB at 819 kB/s)
> > [INFO] Downloaded from central:
> >
> https://repo.maven.apache.org/maven2/org/apache/maven/doxia/doxia-skin-model/1.7.4/doxia-skin-model-1.7.4.jar
> > (16 kB at 213 kB/s)
> > [INFO] Downloading from central:
> >
> https://repo.maven.apache.org/maven2/org/apache/httpcomponents/httpcore/4.4.4/httpcore-4.4.4.jar
> > [INFO] Downloading from central:
> >
> https://repo.maven.apache.org/maven2/commons-logging/commons-logging/1.2/commons-logging-1.2.jar
> > [INFO] Downloaded from central:
> >
> https://repo.maven.apache.org/maven2/org/apache/maven/doxia/doxia-module-xhtml/1.7/doxia-module-xhtml-1.7.jar
> > (17 kB at 224 kB/s)
> > [INFO] Downloading from central:
> >
> https://repo.maven.apache.org/maven2/org/codehaus/plexus/plexus-java/0.9.5/plexus-java-0.9.5.jar
> > [INFO] Downloaded from central:
> >
> https://repo.maven.apache.org/maven2/org/apache/commons/commons-lang3/3.5/commons-lang3-3.5.jar
> > (480 kB at 5.1 MB/s)
> > [INFO] Downloading from central:
> > https://repo.maven.apache.org/maven2/org/ow2/asm/asm/6.0/asm-6.0.jar
> > [INFO] Downloaded from central:
> >
> https://repo.maven.apache.org/maven2/commons-logging/commons-logging/1.2/commons-logging-1.2.jar
> > (62 kB at 606 kB/s)
> > [INFO] Downloaded from central:
> >
> https://repo.maven.apache.org/maven2/org/codehaus/plexus/plexus-java/0.9.5/plexus-java-0.9.5.jar
> > (32 kB at 312 kB/s)
> > [INFO] Downloaded from central:
> >
> https://repo.maven.apache.org/maven2/org/apache/httpcomponents/httpclient/4.5.2/httpclient-4.5.2.jar
> > (737 kB at 7.0 MB/s)
> > [INFO] Downloaded from central:
> >
> https://repo.maven.apache.org/maven2/org/apache/httpcomponents/httpcore/4.4.4/httpcore-4.4.4.jar
> > (327 kB at 3.0 MB/s)
> > [INFO] Downloaded from central:
> > https://repo.maven.apache.org/maven2/org/ow2/asm/asm/6.0/asm-6.0.jar
> (95 kB
> > at 787 kB/s)
> > [JENKINS] Archiving  javadoc
> > [WARNING] Attempt to (de-)serialize anonymous class hudson.FilePath$32;
> > see: https://jenkins.io/redirect/serialization-of-anonymous-classes/
> > [INFO]
> > [INFO] --- maven-javadoc-plugin:3.0.0:jar (create-javadoc-jar) @
> > commons-csv ---
> > [INFO] Building jar: <
> >
> https://builds.apache.org/job/commons-csv/ws/target/commons-csv-1.6-SNAPSHOT-javadoc.jar
> >>
> > [INFO]
> > [INFO] >>> maven-source-plugin:3.0.1:jar (create-source-jar) >
> > generate-sources @ commons-csv >>>
> > [INFO]
> > [INFO] --- maven-enforcer-plugin:1.4.1:enforce (enforce-maven-3) @
> > commons-csv ---
> > [INFO]
> > [INFO] --- build-helper-maven-plugin:3.0.0:parse-version (parse-version)
> @
> > commons-csv ---
> > [INFO]
> > [INFO] --- maven-antrun-plugin:1.8:run (javadoc.resources) @ commons-csv
> ---
> > [INFO] Executing tasks
> >
> > main:
> > [INFO] Executed tasks
> > [WARNING] Failed to getClass for
> > org.apache.maven.plugins.source.SourceJarMojo
> > [INFO]
> > [INFO] <<< maven-source-plugin:3.0.1:jar (create-source-jar) <
> > generate-sources @ commons-csv <<<
> > [INFO]
> > [INFO]
> > [INFO] --- maven-source-plugin:3.0.1:jar (create-source-jar) @
> commons-csv
> > ---
> > [INFO] Building jar: <
> >
> https://builds.apache.org/job/commons-csv/ws/target/commons-csv-1.6-SNAPSHOT-sources.jar
> >>
> > [INFO]
> > [INFO] >>> maven-source-plugin:3.0.1:test-jar (create-source-jar) >
> > generate-sources @ commons-csv >>>
> > [INFO]
> > [INFO] --- maven-enforcer-plugin:1.4.1:enforce (enforce-maven-3) @
> > commons-csv ---
> > [INFO]
> > [INFO] --- build-helper-maven-plugin:3.0.0:parse-version (parse-version)
> @
> > commons-csv ---
> > [INFO]
> > [INFO] --- maven-antrun-plugin:1.8:run (javadoc.resources) @ commons-csv
> ---
> > [INFO] Executing tasks
> >
> > main:
> > [INFO] Executed tasks
> > [WARNING] Failed to getClass for
> > org.apache.maven.plugins.source.TestSourceJarMojo
> > [INFO]
> > [INFO] <<< maven-source-plugin:3.0.1:test-jar (create-source-jar) <
> > generate-sources @ commons-csv <<<
> > [INFO]
> > [INFO]
> > [INFO] --- maven-source-plugin:3.0.1:test-jar (create-source-jar) @
> > commons-csv ---
> > [INFO] Building jar: <
> >
> https://builds.apache.org/job/commons-csv/ws/target/commons-csv-1.6-SNAPSHOT-test-sources.jar
> >>
> > [INFO]
> > [INFO] --- maven-jar-plugin:3.0.0:test-jar (default) @ commons-csv ---
> > [INFO] Building jar: <
> >
> https://builds.apache.org/job/commons-csv/ws/target/commons-csv-1.6-SNAPSHOT-tests.jar
> >>
> > [INFO]
> > [INFO] --- maven-assembly-plugin:2.6:single (default) @ commons-csv ---
> > [INFO] Downloading from central:
> >
> https://repo.maven.apache.org/maven2/org/codehaus/plexus/plexus-archiver/3.0.1/plexus-archiver-3.0.1.pom
> > [INFO] Downloaded from central:
> >
> https://repo.maven.apache.org/maven2/org/codehaus/plexus/plexus-archiver/3.0.1/plexus-archiver-3.0.1.pom
> > (5.8 kB at 214 kB/s)
> > [INFO] Downloading from central:
> >
> https://repo.maven.apache.org/maven2/org/codehaus/plexus/plexus-io/2.6/plexus-io-2.6.pom
> > [INFO] Downloaded from central:
> >
> https://repo.maven.apache.org/maven2/org/codehaus/plexus/plexus-io/2.6/plexus-io-2.6.pom
> > (3.9 kB at 164 kB/s)
> > [INFO] Downloading from central:
> >
> https://repo.maven.apache.org/maven2/org/iq80/snappy/snappy/0.3/snappy-0.3.pom
> > [INFO] Downloaded from central:
> >
> https://repo.maven.apache.org/maven2/org/iq80/snappy/snappy/0.3/snappy-0.3.pom
> > (14 kB at 600 kB/s)
> > [INFO] Downloading from central:
> >
> https://repo.maven.apache.org/maven2/org/apache/maven/shared/file-management/1.1/file-management-1.1.pom
> > [INFO] Downloaded from central:
> >
> https://repo.maven.apache.org/maven2/org/apache/maven/shared/file-management/1.1/file-management-1.1.pom
> > (2.7 kB at 111 kB/s)
> > [INFO] Downloading from central:
> >
> https://repo.maven.apache.org/maven2/org/apache/maven/shared/maven-shared-components/4/maven-shared-components-4.pom
> > [INFO] Downloaded from central:
> >
> https://repo.maven.apache.org/maven2/org/apache/maven/shared/maven-shared-components/4/maven-shared-components-4.pom
> > (2.2 kB at 92 kB/s)
> > [INFO] Downloading from central:
> >
> https://repo.maven.apache.org/maven2/org/apache/maven/shared/maven-shared-io/1.0/maven-shared-io-1.0.pom
> > [INFO] Downloaded from central:
> >
> https://repo.maven.apache.org/maven2/org/apache/maven/shared/maven-shared-io/1.0/maven-shared-io-1.0.pom
> > (3.0 kB at 126 kB/s)
> > [INFO] Downloading from central:
> >
> https://repo.maven.apache.org/maven2/org/apache/maven/shared/maven-filtering/1.3/maven-filtering-1.3.pom
> > [INFO] Downloaded from central:
> >
> https://repo.maven.apache.org/maven2/org/apache/maven/shared/maven-filtering/1.3/maven-filtering-1.3.pom
> > (6.2 kB at 258 kB/s)
> > [INFO] Downloading from central:
> >
> https://repo.maven.apache.org/maven2/org/codehaus/plexus/plexus-utils/3.0.18/plexus-utils-3.0.18.pom
> > [INFO] Downloaded from central:
> >
> https://repo.maven.apache.org/maven2/org/codehaus/plexus/plexus-utils/3.0.18/plexus-utils-3.0.18.pom
> > (3.4 kB at 141 kB/s)
> > [INFO] Downloading from central:
> >
> https://repo.maven.apache.org/maven2/org/apache/maven/shared/maven-repository-builder/1.0/maven-repository-builder-1.0.pom
> > [INFO] Downloaded from central:
> >
> https://repo.maven.apache.org/maven2/org/apache/maven/shared/maven-repository-builder/1.0/maven-repository-builder-1.0.pom
> > (4.6 kB at 190 kB/s)
> > [INFO] Downloading from central:
> >
> https://repo.maven.apache.org/maven2/org/apache/maven/maven-artifact/2.0.4/maven-artifact-2.0.4.pom
> > [INFO] Downloaded from central:
> >
> https://repo.maven.apache.org/maven2/org/apache/maven/maven-artifact/2.0.4/maven-artifact-2.0.4.pom
> > (765 B at 33 kB/s)
> > [INFO] Downloading from central:
> >
> https://repo.maven.apache.org/maven2/org/apache/maven/maven/2.0.4/maven-2.0.4.pom
> > [INFO] Downloaded from central:
> >
> https://repo.maven.apache.org/maven2/org/apache/maven/maven/2.0.4/maven-2.0.4.pom
> > (12 kB at 491 kB/s)
> > [INFO] Downloading from central:
> >
> https://repo.maven.apache.org/maven2/org/apache/maven/maven-artifact-manager/2.0.4/maven-artifact-manager-2.0.4.pom
> > [INFO] Downloaded from central:
> >
> https://repo.maven.apache.org/maven2/org/apache/maven/maven-artifact-manager/2.0.4/maven-artifact-manager-2.0.4.pom
> > (1.4 kB at 59 kB/s)
> > [INFO] Downloading from central:
> >
> https://repo.maven.apache.org/maven2/org/apache/maven/maven-repository-metadata/2.0.4/maven-repository-metadata-2.0.4.pom
> > [INFO] Downloaded from central:
> >
> https://repo.maven.apache.org/maven2/org/apache/maven/maven-repository-metadata/2.0.4/maven-repository-metadata-2.0.4.pom
> > (1.5 kB at 65 kB/s)
> > [INFO] Downloading from central:
> >
> https://repo.maven.apache.org/maven2/org/apache/maven/maven-project/2.0.4/maven-project-2.0.4.pom
> > [INFO] Downloaded from central:
> >
> https://repo.maven.apache.org/maven2/org/apache/maven/maven-project/2.0.4/maven-project-2.0.4.pom
> > (1.8 kB at 77 kB/s)
> > [INFO] Downloading from central:
> >
> https://repo.maven.apache.org/maven2/org/apache/maven/maven-settings/2.0.4/maven-settings-2.0.4.pom
> > [INFO] Downloaded from central:
> >
> https://repo.maven.apache.org/maven2/org/apache/maven/maven-settings/2.0.4/maven-settings-2.0.4.pom
> > (1.6 kB at 71 kB/s)
> > [INFO] Downloading from central:
> >
> https://repo.maven.apache.org/maven2/org/apache/maven/maven-model/2.0.4/maven-model-2.0.4.pom
> > [INFO] Downloaded from central:
> >
> https://repo.maven.apache.org/maven2/org/apache/maven/maven-model/2.0.4/maven-model-2.0.4.pom
> > (2.7 kB at 118 kB/s)
> > [INFO] Downloading from central:
> >
> https://repo.maven.apache.org/maven2/org/apache/maven/maven-profile/2.0.4/maven-profile-2.0.4.pom
> > [INFO] Downloaded from central:
> >
> https://repo.maven.apache.org/maven2/org/apache/maven/maven-profile/2.0.4/maven-profile-2.0.4.pom
> > (1.6 kB at 70 kB/s)
> > [INFO] Downloading from central:
> >
> https://repo.maven.apache.org/maven2/org/codehaus/plexus/plexus-interpolation/1.22/plexus-interpolation-1.22.jar
> > [INFO] Downloading from central:
> >
> https://repo.maven.apache.org/maven2/org/codehaus/plexus/plexus-archiver/3.0.1/plexus-archiver-3.0.1.jar
> > [INFO] Downloading from central:
> >
> https://repo.maven.apache.org/maven2/org/iq80/snappy/snappy/0.3/snappy-0.3.jar
> > [INFO] Downloading from central:
> >
> https://repo.maven.apache.org/maven2/org/apache/maven/shared/file-management/1.1/file-management-1.1.jar
> > [INFO] Downloading from central:
> >
> https://repo.maven.apache.org/maven2/org/apache/maven/shared/maven-filtering/1.3/maven-filtering-1.3.jar
> > [INFO] Downloaded from central:
> >
> https://repo.maven.apache.org/maven2/org/codehaus/plexus/plexus-interpolation/1.22/plexus-interpolation-1.22.jar
> > (77 kB at 2.8 MB/s)
> > [INFO] Downloading from central:
> >
> https://repo.maven.apache.org/maven2/org/codehaus/plexus/plexus-io/2.6/plexus-io-2.6.jar
> > [INFO] Downloaded from central:
> >
> https://repo.maven.apache.org/maven2/org/apache/maven/shared/file-management/1.1/file-management-1.1.jar
> > (31 kB at 1.1 MB/s)
> > [INFO] Downloading from central:
> >
> https://repo.maven.apache.org/maven2/org/apache/maven/shared/maven-repository-builder/1.0/maven-repository-builder-1.0.jar
> > [INFO] Downloaded from central:
> >
> https://repo.maven.apache.org/maven2/org/iq80/snappy/snappy/0.3/snappy-0.3.jar
> > (49 kB at 1.6 MB/s)
> > [INFO] Downloaded from central:
> >
> https://repo.maven.apache.org/maven2/org/apache/maven/shared/maven-filtering/1.3/maven-filtering-1.3.jar
> > (51 kB at 1.7 MB/s)
> > [INFO] Downloaded from central:
> >
> https://repo.maven.apache.org/maven2/org/codehaus/plexus/plexus-archiver/3.0.1/plexus-archiver-3.0.1.jar
> > (381 kB at 8.9 MB/s)
> > [INFO] Downloaded from central:
> >
> https://repo.maven.apache.org/maven2/org/codehaus/plexus/plexus-io/2.6/plexus-io-2.6.jar
> > (84 kB at 1.7 MB/s)
> > [INFO] Downloaded from central:
> >
> https://repo.maven.apache.org/maven2/org/apache/maven/shared/maven-repository-builder/1.0/maven-repository-builder-1.0.jar
> > (22 kB at 425 kB/s)
> > [INFO] Reading assembly descriptor: src/assembly/bin.xml
> > [INFO] Reading assembly descriptor: src/assembly/src.xml
> > [INFO] Building tar: <
> >
> https://builds.apache.org/job/commons-csv/ws/target/commons-csv-1.6-SNAPSHOT-bin.tar.gz
> >>
> > [INFO] Building zip: <
> >
> https://builds.apache.org/job/commons-csv/ws/target/commons-csv-1.6-SNAPSHOT-bin.zip
> >>
> > [INFO] Building tar: <
> >
> https://builds.apache.org/job/commons-csv/ws/target/commons-csv-1.6-SNAPSHOT-src.tar.gz
> >>
> > [INFO] Building zip: <
> >
> https://builds.apache.org/job/commons-csv/ws/target/commons-csv-1.6-SNAPSHOT-src.zip
> >>
> > [INFO]
> > [INFO] --- maven-gpg-plugin:1.6:sign (sign-artifacts) @ commons-csv ---
> > [INFO]
> > [INFO] --- jacoco-maven-plugin:0.7.9:check (check) @ commons-csv ---
> > [INFO] Loading execution data file <
> > https://builds.apache.org/job/commons-csv/ws/target/jacoco.exec>
> > [INFO] Analyzed bundle 'commons-csv' with 15 classes
> > [INFO] All coverage checks have been met.
> > [INFO]
> > [INFO] --- maven-install-plugin:2.5.2:install (default-install) @
> > commons-csv ---
> > [INFO] Installing <
> >
> https://builds.apache.org/job/commons-csv/ws/target/commons-csv-1.6-SNAPSHOT.jar
> >
> > to
> >
> /home/jenkins/jenkins-slave/maven-repositories/1/org/apache/commons/commons-csv/1.6-SNAPSHOT/commons-csv-1.6-SNAPSHOT.jar
> > [INFO] Installing <https://builds.apache.org/job/commons-csv/ws/pom.xml>
> to
> >
> /home/jenkins/jenkins-slave/maven-repositories/1/org/apache/commons/commons-csv/1.6-SNAPSHOT/commons-csv-1.6-SNAPSHOT.pom
> > [INFO] Installing <
> >
> https://builds.apache.org/job/commons-csv/ws/target/commons-csv-1.6-SNAPSHOT-javadoc.jar
> >
> > to
> >
> /home/jenkins/jenkins-slave/maven-repositories/1/org/apache/commons/commons-csv/1.6-SNAPSHOT/commons-csv-1.6-SNAPSHOT-javadoc.jar
> > [INFO] Installing <
> >
> https://builds.apache.org/job/commons-csv/ws/target/commons-csv-1.6-SNAPSHOT-sources.jar
> >
> > to
> >
> /home/jenkins/jenkins-slave/maven-repositories/1/org/apache/commons/commons-csv/1.6-SNAPSHOT/commons-csv-1.6-SNAPSHOT-sources.jar
> > [INFO] Installing <
> >
> https://builds.apache.org/job/commons-csv/ws/target/commons-csv-1.6-SNAPSHOT-test-sources.jar
> >
> > to
> >
> /home/jenkins/jenkins-slave/maven-repositories/1/org/apache/commons/commons-csv/1.6-SNAPSHOT/commons-csv-1.6-SNAPSHOT-test-sources.jar
> > [INFO] Installing <
> >
> https://builds.apache.org/job/commons-csv/ws/target/commons-csv-1.6-SNAPSHOT-tests.jar
> >
> > to
> >
> /home/jenkins/jenkins-slave/maven-repositories/1/org/apache/commons/commons-csv/1.6-SNAPSHOT/commons-csv-1.6-SNAPSHOT-tests.jar
> > [INFO] Installing <
> >
> https://builds.apache.org/job/commons-csv/ws/target/commons-csv-1.6-SNAPSHOT-bin.tar.gz
> >
> > to
> >
> /home/jenkins/jenkins-slave/maven-repositories/1/org/apache/commons/commons-csv/1.6-SNAPSHOT/commons-csv-1.6-SNAPSHOT-bin.tar.gz
> > [INFO] Installing <
> >
> https://builds.apache.org/job/commons-csv/ws/target/commons-csv-1.6-SNAPSHOT-bin.zip
> >
> > to
> >
> /home/jenkins/jenkins-slave/maven-repositories/1/org/apache/commons/commons-csv/1.6-SNAPSHOT/commons-csv-1.6-SNAPSHOT-bin.zip
> > [INFO] Installing <
> >
> https://builds.apache.org/job/commons-csv/ws/target/commons-csv-1.6-SNAPSHOT-src.tar.gz
> >
> > to
> >
> /home/jenkins/jenkins-slave/maven-repositories/1/org/apache/commons/commons-csv/1.6-SNAPSHOT/commons-csv-1.6-SNAPSHOT-src.tar.gz
> > [INFO] Installing <
> >
> https://builds.apache.org/job/commons-csv/ws/target/commons-csv-1.6-SNAPSHOT-src.zip
> >
> > to
> >
> /home/jenkins/jenkins-slave/maven-repositories/1/org/apache/commons/commons-csv/1.6-SNAPSHOT/commons-csv-1.6-SNAPSHOT-src.zip
> > [WARNING] Attempt to (de-)serialize anonymous class
> > hudson.maven.reporters.MavenArtifactArchiver$2; see:
> > https://jenkins.io/redirect/serialization-of-anonymous-classes/
> > [WARNING] Attempt to (de-)serialize anonymous class
> > hudson.maven.reporters.MavenFingerprinter$1; see:
> > https://jenkins.io/redirect/serialization-of-anonymous-classes/
> > [INFO]
> > ------------------------------------------------------------------------
> > [INFO] BUILD SUCCESS
> > [INFO]
> > ------------------------------------------------------------------------
> > [INFO] Total time: 01:51 min
> > [INFO] Finished at: 2018-08-20T06:49:51Z
> > [INFO] Final Memory: 60M/3925M
> > [INFO]
> > ------------------------------------------------------------------------
> > Waiting for Jenkins to finish collecting data
> > [JENKINS] Archiving <
> https://builds.apache.org/job/commons-csv/ws/pom.xml>
> > to
> org.apache.commons/commons-csv/1.6-SNAPSHOT/commons-csv-1.6-SNAPSHOT.pom
> > [JENKINS] Archiving <
> >
> https://builds.apache.org/job/commons-csv/ws/target/commons-csv-1.6-SNAPSHOT.jar
> >
> > to
> org.apache.commons/commons-csv/1.6-SNAPSHOT/commons-csv-1.6-SNAPSHOT.jar
> > [JENKINS] Archiving <
> >
> https://builds.apache.org/job/commons-csv/ws/target/commons-csv-1.6-SNAPSHOT-javadoc.jar
> >
> > to
> >
> org.apache.commons/commons-csv/1.6-SNAPSHOT/commons-csv-1.6-SNAPSHOT-javadoc.jar
> > [JENKINS] Archiving <
> >
> https://builds.apache.org/job/commons-csv/ws/target/commons-csv-1.6-SNAPSHOT-sources.jar
> >
> > to
> >
> org.apache.commons/commons-csv/1.6-SNAPSHOT/commons-csv-1.6-SNAPSHOT-sources.jar
> > [JENKINS] Archiving <
> >
> https://builds.apache.org/job/commons-csv/ws/target/commons-csv-1.6-SNAPSHOT-test-sources.jar
> >
> > to
> >
> org.apache.commons/commons-csv/1.6-SNAPSHOT/commons-csv-1.6-SNAPSHOT-test-sources.jar
> > [JENKINS] Archiving <
> >
> https://builds.apache.org/job/commons-csv/ws/target/commons-csv-1.6-SNAPSHOT-tests.jar
> >
> > to
> >
> org.apache.commons/commons-csv/1.6-SNAPSHOT/commons-csv-1.6-SNAPSHOT-tests.jar
> > [JENKINS] Archiving <
> >
> https://builds.apache.org/job/commons-csv/ws/target/commons-csv-1.6-SNAPSHOT-bin.tar.gz
> >
> > to
> >
> org.apache.commons/commons-csv/1.6-SNAPSHOT/commons-csv-1.6-SNAPSHOT-bin.tar.gz
> > [JENKINS] Archiving <
> >
> https://builds.apache.org/job/commons-csv/ws/target/commons-csv-1.6-SNAPSHOT-bin.zip
> >
> > to
> >
> org.apache.commons/commons-csv/1.6-SNAPSHOT/commons-csv-1.6-SNAPSHOT-bin.zip
> > [JENKINS] Archiving <
> >
> https://builds.apache.org/job/commons-csv/ws/target/commons-csv-1.6-SNAPSHOT-src.tar.gz
> >
> > to
> >
> org.apache.commons/commons-csv/1.6-SNAPSHOT/commons-csv-1.6-SNAPSHOT-src.tar.gz
> > [JENKINS] Archiving <
> >
> https://builds.apache.org/job/commons-csv/ws/target/commons-csv-1.6-SNAPSHOT-src.zip
> >
> > to
> >
> org.apache.commons/commons-csv/1.6-SNAPSHOT/commons-csv-1.6-SNAPSHOT-src.zip
> > [Fast Archiver] Compressed 141.28 MB of artifacts by 74.4% relative to
> #87
> > channel stopped
> > Maven RedeployPublisher use remote beam2 maven settings from :
> > /home/jenkins/.m2/settings.xml
> > [INFO] Deployment in
> > https://repository.apache.org/content/repositories/snapshots
> > (id=apache.snapshots.https,uniqueVersion=true)
> > Deploying the main artifact commons-csv-1.6-SNAPSHOT.jar
> > Downloading:
> >
> https://repository.apache.org/content/repositories/snapshots/org/apache/commons/commons-csv/1.6-SNAPSHOT/maven-metadata.xml
> > Downloaded:
> >
> https://repository.apache.org/content/repositories/snapshots/org/apache/commons/commons-csv/1.6-SNAPSHOT/maven-metadata.xml
> > (3 KB at 2.6 KB/sec)
> > Uploading:
> >
> https://repository.apache.org/content/repositories/snapshots/org/apache/commons/commons-csv/1.6-SNAPSHOT/commons-csv-1.6-20180820.065008-25.jar
> > Uploading:
> >
> https://repository.apache.org/content/repositories/snapshots/org/apache/commons/commons-csv/1.6-SNAPSHOT/commons-csv-1.6-20180820.065008-25.pom
> > ERROR: Failed to deploy artifacts: Could not transfer artifact
> > org.apache.commons:commons-csv:jar:1.6-20180820.065008-25 from/to
> > apache.snapshots.https (
> > https://repository.apache.org/content/repositories/snapshots): Failed to
> > transfer file:
> >
> https://repository.apache.org/content/repositories/snapshots/org/apache/commons/commons-csv/1.6-SNAPSHOT/commons-csv-1.6-20180820.065008-25.jar
> .
> > Return code is: 401, ReasonPhrase: Unauthorized.
> > org.apache.maven.artifact.deployer.ArtifactDeploymentException: Failed to
> > deploy artifacts: Could not transfer artifact
> > org.apache.commons:commons-csv:jar:1.6-20180820.065008-25 from/to
> > apache.snapshots.https (
> > https://repository.apache.org/content/repositories/snapshots): Failed to
> > transfer file:
> >
> https://repository.apache.org/content/repositories/snapshots/org/apache/commons/commons-csv/1.6-SNAPSHOT/commons-csv-1.6-20180820.065008-25.jar
> .
> > Return code is: 401, ReasonPhrase: Unauthorized.
> >         at
> >
> org.apache.maven.artifact.deployer.DefaultArtifactDeployer.deploy(DefaultArtifactDeployer.java:143)
> >         at
> >
> hudson.maven.reporters.MavenArtifactRecord.deploy(MavenArtifactRecord.java:193)
> >         at
> > hudson.maven.RedeployPublisher.perform(RedeployPublisher.java:176)
> >         at
> hudson.tasks.BuildStepMonitor$1.perform(BuildStepMonitor.java:20)
> >         at
> >
> hudson.model.AbstractBuild$AbstractBuildExecution.perform(AbstractBuild.java:744)
> >         at
> >
> hudson.model.AbstractBuild$AbstractBuildExecution.performAllBuildSteps(AbstractBuild.java:690)
> >         at
> >
> hudson.maven.MavenModuleSetBuild$MavenModuleSetBuildExecution.post2(MavenModuleSetBuild.java:1073)
> >         at
> >
> hudson.model.AbstractBuild$AbstractBuildExecution.post(AbstractBuild.java:635)
> >         at hudson.model.Run.execute(Run.java:1819)
> >         at
> > hudson.maven.MavenModuleSetBuild.run(MavenModuleSetBuild.java:543)
> >         at
> > hudson.model.ResourceController.execute(ResourceController.java:97)
> >         at hudson.model.Executor.run(Executor.java:429)
> > Caused by: org.eclipse.aether.deployment.DeploymentException: Failed to
> > deploy artifacts: Could not transfer artifact
> > org.apache.commons:commons-csv:jar:1.6-20180820.065008-25 from/to
> > apache.snapshots.https (
> > https://repository.apache.org/content/repositories/snapshots): Failed to
> > transfer file:
> >
> https://repository.apache.org/content/repositories/snapshots/org/apache/commons/commons-csv/1.6-SNAPSHOT/commons-csv-1.6-20180820.065008-25.jar
> .
> > Return code is: 401, ReasonPhrase: Unauthorized.
> >         at
> >
> org.eclipse.aether.internal.impl.DefaultDeployer.deploy(DefaultDeployer.java:317)
> >         at
> >
> org.eclipse.aether.internal.impl.DefaultDeployer.deploy(DefaultDeployer.java:245)
> >         at
> >
> org.eclipse.aether.internal.impl.DefaultRepositorySystem.deploy(DefaultRepositorySystem.java:420)
> >         at
> >
> org.apache.maven.artifact.deployer.DefaultArtifactDeployer.deploy(DefaultArtifactDeployer.java:139)
> >         ... 11 more
> > Caused by: org.eclipse.aether.transfer.ArtifactTransferException: Could
> not
> > transfer artifact
> org.apache.commons:commons-csv:jar:1.6-20180820.065008-25
> > from/to apache.snapshots.https (
> > https://repository.apache.org/content/repositories/snapshots): Failed to
> > transfer file:
> >
> https://repository.apache.org/content/repositories/snapshots/org/apache/commons/commons-csv/1.6-SNAPSHOT/commons-csv-1.6-20180820.065008-25.jar
> .
> > Return code is: 401, ReasonPhrase: Unauthorized.
> >         at
> >
> org.eclipse.aether.connector.basic.ArtifactTransportListener.transferFailed(ArtifactTransportListener.java:43)
> >         at
> >
> org.eclipse.aether.connector.basic.BasicRepositoryConnector$TaskRunner.run(BasicRepositoryConnector.java:355)
> >         at
> >
> org.eclipse.aether.connector.basic.BasicRepositoryConnector.put(BasicRepositoryConnector.java:274)
> >         at
> >
> org.eclipse.aether.internal.impl.DefaultDeployer.deploy(DefaultDeployer.java:311)
> >         ... 14 more
> > Caused by: org.apache.maven.wagon.TransferFailedException: Failed to
> > transfer file:
> >
> https://repository.apache.org/content/repositories/snapshots/org/apache/commons/commons-csv/1.6-SNAPSHOT/commons-csv-1.6-20180820.065008-25.jar
> .
> > Return code is: 401, ReasonPhrase: Unauthorized.
> >         at
> >
> org.apache.maven.wagon.shared.http.AbstractHttpClientWagon.put(AbstractHttpClientWagon.java:635)
> >         at
> >
> org.apache.maven.wagon.shared.http.AbstractHttpClientWagon.put(AbstractHttpClientWagon.java:557)
> >         at
> >
> org.apache.maven.wagon.shared.http.AbstractHttpClientWagon.put(AbstractHttpClientWagon.java:539)
> >         at
> >
> org.apache.maven.wagon.shared.http.AbstractHttpClientWagon.put(AbstractHttpClientWagon.java:533)
> >         at
> >
> org.apache.maven.wagon.shared.http.AbstractHttpClientWagon.put(AbstractHttpClientWagon.java:513)
> >         at
> >
> org.eclipse.aether.transport.wagon.WagonTransporter$PutTaskRunner.run(WagonTransporter.java:644)
> >         at
> >
> org.eclipse.aether.transport.wagon.WagonTransporter.execute(WagonTransporter.java:427)
> >         at
> >
> org.eclipse.aether.transport.wagon.WagonTransporter.put(WagonTransporter.java:410)
> >         at
> >
> org.eclipse.aether.connector.basic.BasicRepositoryConnector$PutTaskRunner.runTask(BasicRepositoryConnector.java:510)
> >         at
> >
> org.eclipse.aether.connector.basic.BasicRepositoryConnector$TaskRunner.run(BasicRepositoryConnector.java:350)
> >         ... 16 more
> > [INFO] Deployment failed after 2.7 sec
> > Build step 'Deploy artifacts to Maven repository' changed build result to
> > FAILURE
>
> ---------------------------------------------------------------------
> To unsubscribe, e-mail: [hidden email]
> For additional commands, e-mail: [hidden email]
>
>