[GUMP@vmgump]: Project commons-javaflow (in module jakarta-commons-sandbox) failed

classic Classic list List threaded Threaded
6 messages Options
Reply | Threaded
Open this post in threaded view
|

[GUMP@vmgump]: Project commons-javaflow (in module jakarta-commons-sandbox) failed

Stefan Bodewig
To whom it may engage...
       
This is an automated request, but not an unsolicited one. For
more information please visit http://gump.apache.org/nagged.html,
and/or contact the folk at [hidden email].

Project commons-javaflow has an issue affecting its community integration.
This issue affects 4 projects,
 and has been outstanding for 2 runs.
The current state of this project is 'Failed', with reason 'Build Failed'.
For reference only, the following projects are affected by this:
    - cocoon-block-javaflow :  Java XML Framework
    - cocoon-block-mail :  Java XML Framework
    - cocoon-block-scratchpad :  Java XML Framework
    - commons-javaflow :  Commons Javaflow


Full details are available at:
    http://vmgump.apache.org/gump/public/jakarta-commons-sandbox/commons-javaflow/index.html

That said, some information snippets are provided here.

The following annotations (debug/informational/warning/error messages) were provided:
 -DEBUG- Sole output [commons-javaflow-01082005.jar] identifier set to project name
 -DEBUG- (Gump generated) Maven Properties in: /usr/local/gump/public/workspace/jakarta-commons-sandbox/javaflow/build.properties
 -INFO- Failed with reason build failed
 -DEBUG- Maven POM in: /usr/local/gump/public/workspace/jakarta-commons-sandbox/javaflow/project.xml
 -DEBUG- Maven project properties in: /usr/local/gump/public/workspace/jakarta-commons-sandbox/javaflow/project.properties
 -DEBUG- Extracted fallback artifacts from Gump Repository



The following work was performed:
http://vmgump.apache.org/gump/public/jakarta-commons-sandbox/commons-javaflow/gump_work/build_jakarta-commons-sandbox_commons-javaflow.html
Work Name: build_jakarta-commons-sandbox_commons-javaflow (Type: Build)
Work ended in a state of : Failed
Elapsed: 13 secs
Command Line: maven --offline jar
[Working Directory: /usr/local/gump/public/workspace/jakarta-commons-sandbox/javaflow]
CLASSPATH: /opt/jdk1.4/lib/tools.jar:/usr/local/gump/public/workspace/ant/dist/lib/ant-jmf.jar:/usr/local/gump/public/workspace/ant/dist/lib/ant-swing.jar:/usr/local/gump/public/workspace/ant/dist/lib/ant-apache-resolver.jar:/usr/local/gump/public/workspace/ant/dist/lib/ant-trax.jar:/usr/local/gump/public/workspace/ant/dist/lib/ant-junit.jar:/usr/local/gump/public/workspace/ant/dist/lib/ant-launcher.jar:/usr/local/gump/public/workspace/ant/dist/lib/ant-nodeps.jar:/usr/local/gump/public/workspace/ant/dist/lib/ant.jar:/usr/local/gump/public/workspace/jakarta-bcel/bin/bcel.jar:/usr/local/gump/public/workspace/jakarta-commons/io/dist/jakarta-commons-io-01082005.jar:/usr/local/gump/public/workspace/jakarta-commons-sandbox/jci/target/commons-jci-01082005.jar:/usr/local/gump/public/workspace/jakarta-commons/logging/dist/commons-logging-01082005.jar:/usr/local/gump/public/workspace/jakarta-commons/logging/dist/commons-logging-api-01082005.jar:/usr/local/gump/public/workspace/jakarta-jmeter/lib/xstream-1.1.2.jar:/usr/local/gump/public/workspace/dist/junit/junit.jar
---------------------------------------------
| |\/| / _` \ V / -_) ' \  ~ intelligent projects ~
|_|  |_\__,_|\_/\___|_||_|  v. 1.0.2

build:start:

java:prepare-filesystem:
    [mkdir] Created dir: /x1/gump/public/workspace/jakarta-commons-sandbox/javaflow/target/classes

java:compile:
    [echo] Compiling to /x1/gump/public/workspace/jakarta-commons-sandbox/javaflow/target/classes
    [echo]
==========================================================

  NOTE: Targetting JVM 1.4, classes
  will not run on earlier JVMs

==========================================================
         
    [javac] Compiling 28 source files to /x1/gump/public/workspace/jakarta-commons-sandbox/javaflow/target/classes

java:jar-resources:

test:prepare-filesystem:
    [mkdir] Created dir: /x1/gump/public/workspace/jakarta-commons-sandbox/javaflow/target/test-classes
    [mkdir] Created dir: /x1/gump/public/workspace/jakarta-commons-sandbox/javaflow/target/test-reports

test:test-resources:

test:compile:
    [javac] Compiling 9 source files to /x1/gump/public/workspace/jakarta-commons-sandbox/javaflow/target/test-classes

test:test:
    [junit] Running org.apache.commons.javaflow.ContinuationTestCase
    [junit] Tests run: 2, Failures: 0, Errors: 2, Time elapsed: 1.651 sec
    [junit] [ERROR] TEST org.apache.commons.javaflow.ContinuationTestCase FAILED
    [junit] Running org.apache.commons.javaflow.ContinuationCompilingClassLoaderTestCase
    [junit] Tests run: 1, Failures: 0, Errors: 0, Time elapsed: 0.494 sec
    [junit] Running org.apache.commons.javaflow.SerializationTestCase
    [junit] Tests run: 2, Failures: 0, Errors: 2, Time elapsed: 1.454 sec
    [junit] [ERROR] TEST org.apache.commons.javaflow.SerializationTestCase FAILED

BUILD FAILED
File...... /home/gump/.maven/cache/maven-test-plugin-1.6.2/plugin.jelly
Element... fail
Line...... 181
Column.... 54
There were test failures.
Total time: 12 seconds
Finished at: Mon Aug 01 02:40:57 PDT 2005

---------------------------------------------

To subscribe to this information via syndicated feeds:
- RSS: http://vmgump.apache.org/gump/public/jakarta-commons-sandbox/commons-javaflow/rss.xml
- Atom: http://vmgump.apache.org/gump/public/jakarta-commons-sandbox/commons-javaflow/atom.xml

============================== Gump Tracking Only ===
Produced by Gump version 2.2.
Gump Run 31000001082005, vmgump.apache.org:vmgump-public:31000001082005
Gump E-mail Identifier (unique within run) #11.

--
Apache Gump
http://gump.apache.org/ [Instance: vmgump]

---------------------------------------------------------------------
To unsubscribe, e-mail: [hidden email]
For additional commands, e-mail: [hidden email]

Reply | Threaded
Open this post in threaded view
|

Re: [GUMP@vmgump]: Project commons-javaflow (in module jakarta-commons-sandbox) failed

Kohsuke Kawaguchi

I couldn't reproduce this problem on my machine.

I also checked out the fresh workspace on a different machine and run
"maven test" but it all passed.

Is there any way to look at the test report to see how the test is failing?

Stefan Bodewig wrote:

> To whom it may engage...
>        
> This is an automated request, but not an unsolicited one. For
> more information please visit http://gump.apache.org/nagged.html,
> and/or contact the folk at [hidden email].
>
> Project commons-javaflow has an issue affecting its community integration.
> This issue affects 4 projects,
>  and has been outstanding for 2 runs.
> The current state of this project is 'Failed', with reason 'Build Failed'.
> For reference only, the following projects are affected by this:
>     - cocoon-block-javaflow :  Java XML Framework
>     - cocoon-block-mail :  Java XML Framework
>     - cocoon-block-scratchpad :  Java XML Framework
>     - commons-javaflow :  Commons Javaflow
>
>
> Full details are available at:
>     http://vmgump.apache.org/gump/public/jakarta-commons-sandbox/commons-javaflow/index.html
>
> That said, some information snippets are provided here.
>
> The following annotations (debug/informational/warning/error messages) were provided:
>  -DEBUG- Sole output [commons-javaflow-01082005.jar] identifier set to project name
>  -DEBUG- (Gump generated) Maven Properties in: /usr/local/gump/public/workspace/jakarta-commons-sandbox/javaflow/build.properties
>  -INFO- Failed with reason build failed
>  -DEBUG- Maven POM in: /usr/local/gump/public/workspace/jakarta-commons-sandbox/javaflow/project.xml
>  -DEBUG- Maven project properties in: /usr/local/gump/public/workspace/jakarta-commons-sandbox/javaflow/project.properties
>  -DEBUG- Extracted fallback artifacts from Gump Repository
>
>
>
> The following work was performed:
> http://vmgump.apache.org/gump/public/jakarta-commons-sandbox/commons-javaflow/gump_work/build_jakarta-commons-sandbox_commons-javaflow.html
> Work Name: build_jakarta-commons-sandbox_commons-javaflow (Type: Build)
> Work ended in a state of : Failed
> Elapsed: 13 secs
> Command Line: maven --offline jar
> [Working Directory: /usr/local/gump/public/workspace/jakarta-commons-sandbox/javaflow]
> CLASSPATH: /opt/jdk1.4/lib/tools.jar:/usr/local/gump/public/workspace/ant/dist/lib/ant-jmf.jar:/usr/local/gump/public/workspace/ant/dist/lib/ant-swing.jar:/usr/local/gump/public/workspace/ant/dist/lib/ant-apache-resolver.jar:/usr/local/gump/public/workspace/ant/dist/lib/ant-trax.jar:/usr/local/gump/public/workspace/ant/dist/lib/ant-junit.jar:/usr/local/gump/public/workspace/ant/dist/lib/ant-launcher.jar:/usr/local/gump/public/workspace/ant/dist/lib/ant-nodeps.jar:/usr/local/gump/public/workspace/ant/dist/lib/ant.jar:/usr/local/gump/public/workspace/jakarta-bcel/bin/bcel.jar:/usr/local/gump/public/workspace/jakarta-commons/io/dist/jakarta-commons-io-01082005.jar:/usr/local/gump/public/workspace/jakarta-commons-sandbox/jci/target/commons-jci-01082005.jar:/usr/local/gump/public/workspace/jakarta-commons/logging/dist/commons-logging-01082005.jar:/usr/local/gump/public/workspace/jakarta-commons/logging/dist/commons-logging-api-01082005.jar:/usr/local/gump/public/workspace/jakar
ta!

> -jmeter/lib/xstream-1.1.2.jar:/usr/local/gump/public/workspace/dist/junit/junit.jar
> ---------------------------------------------
> | |\/| / _` \ V / -_) ' \  ~ intelligent projects ~
> |_|  |_\__,_|\_/\___|_||_|  v. 1.0.2
>
> build:start:
>
> java:prepare-filesystem:
>     [mkdir] Created dir: /x1/gump/public/workspace/jakarta-commons-sandbox/javaflow/target/classes
>
> java:compile:
>     [echo] Compiling to /x1/gump/public/workspace/jakarta-commons-sandbox/javaflow/target/classes
>     [echo]
> ==========================================================
>
>   NOTE: Targetting JVM 1.4, classes
>   will not run on earlier JVMs
>
> ==========================================================
>          
>     [javac] Compiling 28 source files to /x1/gump/public/workspace/jakarta-commons-sandbox/javaflow/target/classes
>
> java:jar-resources:
>
> test:prepare-filesystem:
>     [mkdir] Created dir: /x1/gump/public/workspace/jakarta-commons-sandbox/javaflow/target/test-classes
>     [mkdir] Created dir: /x1/gump/public/workspace/jakarta-commons-sandbox/javaflow/target/test-reports
>
> test:test-resources:
>
> test:compile:
>     [javac] Compiling 9 source files to /x1/gump/public/workspace/jakarta-commons-sandbox/javaflow/target/test-classes
>
> test:test:
>     [junit] Running org.apache.commons.javaflow.ContinuationTestCase
>     [junit] Tests run: 2, Failures: 0, Errors: 2, Time elapsed: 1.651 sec
>     [junit] [ERROR] TEST org.apache.commons.javaflow.ContinuationTestCase FAILED
>     [junit] Running org.apache.commons.javaflow.ContinuationCompilingClassLoaderTestCase
>     [junit] Tests run: 1, Failures: 0, Errors: 0, Time elapsed: 0.494 sec
>     [junit] Running org.apache.commons.javaflow.SerializationTestCase
>     [junit] Tests run: 2, Failures: 0, Errors: 2, Time elapsed: 1.454 sec
>     [junit] [ERROR] TEST org.apache.commons.javaflow.SerializationTestCase FAILED
>
> BUILD FAILED
> File...... /home/gump/.maven/cache/maven-test-plugin-1.6.2/plugin.jelly
> Element... fail
> Line...... 181
> Column.... 54
> There were test failures.
> Total time: 12 seconds
> Finished at: Mon Aug 01 02:40:57 PDT 2005
>
> ---------------------------------------------
>
> To subscribe to this information via syndicated feeds:
> - RSS: http://vmgump.apache.org/gump/public/jakarta-commons-sandbox/commons-javaflow/rss.xml
> - Atom: http://vmgump.apache.org/gump/public/jakarta-commons-sandbox/commons-javaflow/atom.xml
>
> ============================== Gump Tracking Only ===
> Produced by Gump version 2.2.
> Gump Run 31000001082005, vmgump.apache.org:vmgump-public:31000001082005
> Gump E-mail Identifier (unique within run) #11.
>
> --
> Apache Gump
> http://gump.apache.org/ [Instance: vmgump]
>
> ---------------------------------------------------------------------
> To unsubscribe, e-mail: [hidden email]
> For additional commands, e-mail: [hidden email]
>
>


--
Kohsuke Kawaguchi

---------------------------------------------------------------------
To unsubscribe, e-mail: [hidden email]
For additional commands, e-mail: [hidden email]

Reply | Threaded
Open this post in threaded view
|

Re: [GUMP@vmgump]: Project commons-javaflow (in module jakarta-commons-sandbox) failed

Brett Porter-2
You need to update the gump descriptor to indicate where it can find the
test files so they get linked in from this page:
http://vmgump.apache.org/gump/public/jakarta-commons-sandbox/commons-javaflow/index.html

- Brett

Kohsuke Kawaguchi wrote:

>
> I couldn't reproduce this problem on my machine.
>
> I also checked out the fresh workspace on a different machine and run
> "maven test" but it all passed.
>
> Is there any way to look at the test report to see how the test is
> failing?



---------------------------------------------------------------------
To unsubscribe, e-mail: [hidden email]
For additional commands, e-mail: [hidden email]

Reply | Threaded
Open this post in threaded view
|

Re: [GUMP@vmgump]: Project commons-javaflow (in module jakarta-commons-sandbox) failed

Kohsuke Kawaguchi
Brett Porter wrote:
> You need to update the gump descriptor to indicate where it can find the
> test files so they get linked in from this page:
> http://vmgump.apache.org/gump/public/jakarta-commons-sandbox/commons-javaflow/index.html

Sorry for a asking a newbie question, but where's the gump descriptor
and how do I update it?

Does that mean we need to have something like [1] inside the javaflow
project? If so, that looks way beyond me. I hope Torsten knows how to do it.

[1] http://svn.apache.org/repos/asf/cocoon/trunk/gump.xml
--
Kohsuke Kawaguchi

---------------------------------------------------------------------
To unsubscribe, e-mail: [hidden email]
For additional commands, e-mail: [hidden email]

Reply | Threaded
Open this post in threaded view
|

Re: [GUMP@vmgump]: Project commons-javaflow (in module jakarta-commons-sandbox) failed

Brett Porter-2
Someone needs to edit:
http://svn.apache.org/repos/asf/gump/metadata/project/jakarta-commons-sandbox.xml
(which all Apache committers can)

You should add:

    <junitreport nested="./target/test-reports" />

to the section that already exists for javaflow.

Cheers,
Brett

Kohsuke Kawaguchi wrote:

> Brett Porter wrote:
>
>> You need to update the gump descriptor to indicate where it can find the
>> test files so they get linked in from this page:
>> http://vmgump.apache.org/gump/public/jakarta-commons-sandbox/commons-javaflow/index.html
>>
>
>
> Sorry for a asking a newbie question, but where's the gump descriptor
> and how do I update it?
>
> Does that mean we need to have something like [1] inside the javaflow
> project? If so, that looks way beyond me. I hope Torsten knows how to
> do it.
>
> [1] http://svn.apache.org/repos/asf/cocoon/trunk/gump.xml



---------------------------------------------------------------------
To unsubscribe, e-mail: [hidden email]
For additional commands, e-mail: [hidden email]

Reply | Threaded
Open this post in threaded view
|

Re: [GUMP@vmgump]: Project commons-javaflow (in module jakarta-commons-sandbox) failed

Kohsuke Kawaguchi
Brett Porter wrote:
> Someone needs to edit:
> http://svn.apache.org/repos/asf/gump/metadata/project/jakarta-commons-sandbox.xml
> (which all Apache committers can)
>
> You should add:
>
>     <junitreport nested="./target/test-reports" />
>
> to the section that already exists for javaflow.

Thanks for a detailed instruction. I made the change.


--
Kohsuke Kawaguchi

---------------------------------------------------------------------
To unsubscribe, e-mail: [hidden email]
For additional commands, e-mail: [hidden email]