[VOTE][RC1] Release Apache Commons Math 3.5

classic Classic list List threaded Threaded
14 messages Options
Reply | Threaded
Open this post in threaded view
|

[VOTE][RC1] Release Apache Commons Math 3.5

Luc Maisonobe-2
This is a [VOTE] for releasing Apache Commons Math 3.5 from release
candidate 1.

Tag name: MATH_3_5_RC1 (signature can be checked from git using 'git tag
-v')

Tag URL:

<https://git-wip-us.apache.org/repos/asf?p=commons-math.git;a=commit;h=7efda3f0a0941362e9e4152d0e0e92872a8ce8d3>

Commit ID the tag points at: 7efda3f0a0941362e9e4152d0e0e92872a8ce8d3

Site: <http://people.apache.org/~luc/commons-math-3.5-RC1-site>

Distribution files: https://dist.apache.org/repos/dist/dev/commons/math/

Distribution files hashes (SHA1):
3a06c6297f4975b6a5f32bacdfad126c8cec94b7 commons-math3-3.5-bin.tar.gz
2873864620239f4a3efd3d088f06fbd2d533b224 commons-math3-3.5-bin.zip
7ff72a98ea2da18dda7846adc699a18893b8c26b commons-math3-3.5-src.tar.gz
2838050ebe95fb5456e1eca15af1e005b08011fa commons-math3-3.5-src.zip

The svn commit revision for the distribution files above is r8586.

KEYS file to check signatures: http://www.apache.org/dist/commons/KEYS

Maven artifacts:

<https://repository.apache.org/content/repositories/orgapachecommons-1087/org/apache/commons/commons-math3/3.5/>

[ ] +1 Release it.
[ ] +0 Go ahead; I don't care.
[ ] -0 There are a few minor glitches: ...
[ ] -1 No, do not release it because ...

This vote will close in 72 hours, at 2015-04-15T19:00:00Z (this is UTC
time).


---------------------------------------------------------------------
To unsubscribe, e-mail: [hidden email]
For additional commands, e-mail: [hidden email]

Reply | Threaded
Open this post in threaded view
|

Re: [VOTE][RC1] Release Apache Commons Math 3.5

Bruno P. Kinoshita
+1 non binding.

Build works fine in the following environment
Apache Maven 3.2.5 (12a6b3acb947671f09b81f49094c53f426d8cea1; 2014-12-15T06:29:23+13:00)
Maven home: /opt/apache-maven-3.2.5
Java version: 1.8.0_40, vendor: Oracle Corporation
Java home: /usr/lib/jvm/java-8-oracle/jre
Default locale: en_US, platform encoding: UTF-8
OS name: "linux", version: "3.16.0-34-generic", arch: "amd64", family: "unix"

Site generated corrected with the right version. All tests pass, 37 skipped. No new checkstyle errors, no new PMD errors (one was fixed I think), and no new findbugs errors as well.
CheersBruno

 
      From: Luc Maisonobe <[hidden email]>
 To: Commons Developers List <[hidden email]>
 Sent: Monday, April 13, 2015 6:38 AM
 Subject: [VOTE][RC1] Release Apache Commons Math 3.5
   
This is a [VOTE] for releasing Apache Commons Math 3.5 from release
candidate 1.

Tag name: MATH_3_5_RC1 (signature can be checked from git using 'git tag
-v')

Tag URL:

<https://git-wip-us.apache.org/repos/asf?p=commons-math.git;a=commit;h=7efda3f0a0941362e9e4152d0e0e92872a8ce8d3>

Commit ID the tag points at: 7efda3f0a0941362e9e4152d0e0e92872a8ce8d3

Site: <http://people.apache.org/~luc/commons-math-3.5-RC1-site>

Distribution files: https://dist.apache.org/repos/dist/dev/commons/math/

Distribution files hashes (SHA1):
3a06c6297f4975b6a5f32bacdfad126c8cec94b7 commons-math3-3.5-bin.tar.gz
2873864620239f4a3efd3d088f06fbd2d533b224 commons-math3-3.5-bin.zip
7ff72a98ea2da18dda7846adc699a18893b8c26b commons-math3-3.5-src.tar.gz
2838050ebe95fb5456e1eca15af1e005b08011fa commons-math3-3.5-src.zip

The svn commit revision for the distribution files above is r8586.

KEYS file to check signatures: http://www.apache.org/dist/commons/KEYS

Maven artifacts:

<https://repository.apache.org/content/repositories/orgapachecommons-1087/org/apache/commons/commons-math3/3.5/>

[ ] +1 Release it.
[ ] +0 Go ahead; I don't care.
[ ] -0 There are a few minor glitches: ...
[ ] -1 No, do not release it because ...

This vote will close in 72 hours, at 2015-04-15T19:00:00Z (this is UTC
time).


---------------------------------------------------------------------
To unsubscribe, e-mail: [hidden email]
For additional commands, e-mail: [hidden email]



   
 
Reply | Threaded
Open this post in threaded view
|

Re: [VOTE][RC1] Release Apache Commons Math 3.5

Luc Maisonobe-2
+1 from myself.

Luc

Le 2015-04-13 00:02, Bruno P. Kinoshita a écrit :

> +1 non binding.
>
> Build works fine in the following environment
> Apache Maven 3.2.5 (12a6b3acb947671f09b81f49094c53f426d8cea1;
> 2014-12-15T06:29:23+13:00)
> Maven home: /opt/apache-maven-3.2.5
> Java version: 1.8.0_40, vendor: Oracle Corporation
> Java home: /usr/lib/jvm/java-8-oracle/jre
> Default locale: en_US, platform encoding: UTF-8
> OS name: "linux", version: "3.16.0-34-generic", arch: "amd64", family:
> "unix"
>
> Site generated corrected with the right version. All tests pass, 37
> skipped. No new checkstyle errors, no new PMD errors (one was fixed I
> think), and no new findbugs errors as well.
> CheersBruno
>
>
>       From: Luc Maisonobe <[hidden email]>
>  To: Commons Developers List <[hidden email]>
>  Sent: Monday, April 13, 2015 6:38 AM
>  Subject: [VOTE][RC1] Release Apache Commons Math 3.5
>
> This is a [VOTE] for releasing Apache Commons Math 3.5 from release
> candidate 1.
>
> Tag name: MATH_3_5_RC1 (signature can be checked from git using 'git
> tag
> -v')
>
> Tag URL:
>
> <https://git-wip-us.apache.org/repos/asf?p=commons-math.git;a=commit;h=7efda3f0a0941362e9e4152d0e0e92872a8ce8d3>
>
> Commit ID the tag points at: 7efda3f0a0941362e9e4152d0e0e92872a8ce8d3
>
> Site: <http://people.apache.org/~luc/commons-math-3.5-RC1-site>
>
> Distribution files:
> https://dist.apache.org/repos/dist/dev/commons/math/
>
> Distribution files hashes (SHA1):
> 3a06c6297f4975b6a5f32bacdfad126c8cec94b7 commons-math3-3.5-bin.tar.gz
> 2873864620239f4a3efd3d088f06fbd2d533b224 commons-math3-3.5-bin.zip
> 7ff72a98ea2da18dda7846adc699a18893b8c26b commons-math3-3.5-src.tar.gz
> 2838050ebe95fb5456e1eca15af1e005b08011fa commons-math3-3.5-src.zip
>
> The svn commit revision for the distribution files above is r8586.
>
> KEYS file to check signatures: http://www.apache.org/dist/commons/KEYS
>
> Maven artifacts:
>
> <https://repository.apache.org/content/repositories/orgapachecommons-1087/org/apache/commons/commons-math3/3.5/>
>
> [ ] +1 Release it.
> [ ] +0 Go ahead; I don't care.
> [ ] -0 There are a few minor glitches: ...
> [ ] -1 No, do not release it because ...
>
> This vote will close in 72 hours, at 2015-04-15T19:00:00Z (this is UTC
> time).
>
>
> ---------------------------------------------------------------------
> To unsubscribe, e-mail: [hidden email]
> For additional commands, e-mail: [hidden email]

---------------------------------------------------------------------
To unsubscribe, e-mail: [hidden email]
For additional commands, e-mail: [hidden email]

Reply | Threaded
Open this post in threaded view
|

Re: [VOTE][RC1] Release Apache Commons Math 3.5

garydgregory
When I build from the src zip, I get a bunch of:

[ERROR]
java.lang.IllegalArgumentException: One of setGitDir or setWorkTree must be
called.
        at
org.eclipse.jgit.lib.BaseRepositoryBuilder.requireGitDirOrWorkTree(BaseRepositoryBuilder.java:582)
        at
org.eclipse.jgit.lib.BaseRepositoryBuilder.setup(BaseRepositoryBuilder.java:550)
        at
org.eclipse.jgit.storage.file.FileRepositoryBuilder.build(FileRepositoryBuilder.java:89)
        at
ru.concerteza.util.buildnumber.BuildNumberExtractor.extract(BuildNumberExtractor.java:38)
        at
ru.concerteza.util.buildnumber.JGitBuildNumberMojo.execute(JGitBuildNumberMojo.java:124)
        at
org.apache.maven.plugin.DefaultBuildPluginManager.executeMojo(DefaultBuildPluginManager.java:134)
        at
org.apache.maven.lifecycle.internal.MojoExecutor.execute(MojoExecutor.java:208)
        at
org.apache.maven.lifecycle.internal.MojoExecutor.execute(MojoExecutor.java:153)
        at
org.apache.maven.lifecycle.internal.MojoExecutor.execute(MojoExecutor.java:145)
        at
org.apache.maven.lifecycle.internal.MojoExecutor.executeForkedExecutions(MojoExecutor.java:364)
        at
org.apache.maven.lifecycle.DefaultLifecycleExecutor.executeForkedExecutions(DefaultLifecycleExecutor.java:173)
        at
org.apache.maven.reporting.exec.DefaultMavenReportExecutor.buildReportPlugin(DefaultMavenReportExecutor.java:273)
        at
org.apache.maven.reporting.exec.DefaultMavenReportExecutor.buildMavenReports(DefaultMavenReportExecutor.java:154)
        at
org.apache.maven.plugins.site.AbstractSiteRenderingMojo.getReports(AbstractSiteRenderingMojo.java:235)
        at org.apache.maven.plugins.site.SiteMojo.execute(SiteMojo.java:121)
        at
org.apache.maven.plugin.DefaultBuildPluginManager.executeMojo(DefaultBuildPluginManager.java:134)
        at
org.apache.maven.lifecycle.internal.MojoExecutor.execute(MojoExecutor.java:208)
        at
org.apache.maven.lifecycle.internal.MojoExecutor.execute(MojoExecutor.java:153)
        at
org.apache.maven.lifecycle.internal.MojoExecutor.execute(MojoExecutor.java:145)
        at
org.apache.maven.lifecycle.internal.LifecycleModuleBuilder.buildProject(LifecycleModuleBuilder.java:116)
        at
org.apache.maven.lifecycle.internal.LifecycleModuleBuilder.buildProject(LifecycleModuleBuilder.java:80)
        at
org.apache.maven.lifecycle.internal.builder.singlethreaded.SingleThreadedBuilder.build(SingleThreadedBuilder.java:51)
        at
org.apache.maven.lifecycle.internal.LifecycleStarter.execute(LifecycleStarter.java:128)
        at org.apache.maven.DefaultMaven.doExecute(DefaultMaven.java:307)
        at org.apache.maven.DefaultMaven.doExecute(DefaultMaven.java:193)
        at org.apache.maven.DefaultMaven.execute(DefaultMaven.java:106)
        at org.apache.maven.cli.MavenCli.execute(MavenCli.java:862)
        at org.apache.maven.cli.MavenCli.doMain(MavenCli.java:286)
        at org.apache.maven.cli.MavenCli.main(MavenCli.java:197)
        at sun.reflect.NativeMethodAccessorImpl.invoke0(Native Method)
        at
sun.reflect.NativeMethodAccessorImpl.invoke(NativeMethodAccessorImpl.java:57)
        at
sun.reflect.DelegatingMethodAccessorImpl.invoke(DelegatingMethodAccessorImpl.java:43)
        at java.lang.reflect.Method.invoke(Method.java:606)
        at
org.codehaus.plexus.classworlds.launcher.Launcher.launchEnhanced(Launcher.java:289)
        at
org.codehaus.plexus.classworlds.launcher.Launcher.launch(Launcher.java:229)
        at
org.codehaus.plexus.classworlds.launcher.Launcher.mainWithExitCode(Launcher.java:415)
        at
org.codehaus.plexus.classworlds.launcher.Launcher.main(Launcher.java:356)

and one:

[WARN] An issue has occurred with report
org.apache.maven.plugin.jira.JiraMojo, skip LinkageError
org.slf4j.spi.LocationAwareLogger.log(Lorg/slf4j/Marker;Ljava/lang/String;ILjava/lang/String;Ljava/lang/Throwable;)V,
please report an issue to Maven dev team.
java.lang.NoSuchMethodError:
org.slf4j.spi.LocationAwareLogger.log(Lorg/slf4j/Marker;Ljava/lang/String;ILjava/lang/String;Ljava/lang/Throwable;)V
        at
org.apache.commons.logging.impl.SLF4JLocationAwareLog.trace(SLF4JLocationAwareLog.java:99)
        at
org.apache.commons.httpclient.methods.GetMethod.<init>(GetMethod.java:89)
        at
org.apache.maven.plugin.jira.ClassicJiraDownloader.download(ClassicJiraDownloader.java:364)
        at
org.apache.maven.plugin.jira.ClassicJiraDownloader.doExecute(ClassicJiraDownloader.java:123)
        at
org.apache.maven.plugin.jira.AdaptiveJiraDownloader.doExecute(AdaptiveJiraDownloader.java:54)
        at
org.apache.maven.plugin.jira.JiraMojo.executeReport(JiraMojo.java:367)
        at
org.apache.maven.reporting.AbstractMavenReport.generate(AbstractMavenReport.java:190)
        at
org.apache.maven.plugins.site.ReportDocumentRenderer.renderDocument(ReportDocumentRenderer.java:219)
        at
org.apache.maven.doxia.siterenderer.DefaultSiteRenderer.renderModule(DefaultSiteRenderer.java:319)
        at
org.apache.maven.doxia.siterenderer.DefaultSiteRenderer.render(DefaultSiteRenderer.java:135)
        at
org.apache.maven.plugins.site.SiteMojo.renderLocale(SiteMojo.java:175)
        at org.apache.maven.plugins.site.SiteMojo.execute(SiteMojo.java:138)
        at
org.apache.maven.plugin.DefaultBuildPluginManager.executeMojo(DefaultBuildPluginManager.java:134)
        at
org.apache.maven.lifecycle.internal.MojoExecutor.execute(MojoExecutor.java:208)
        at
org.apache.maven.lifecycle.internal.MojoExecutor.execute(MojoExecutor.java:153)
        at
org.apache.maven.lifecycle.internal.MojoExecutor.execute(MojoExecutor.java:145)
        at
org.apache.maven.lifecycle.internal.LifecycleModuleBuilder.buildProject(LifecycleModuleBuilder.java:116)
        at
org.apache.maven.lifecycle.internal.LifecycleModuleBuilder.buildProject(LifecycleModuleBuilder.java:80)
        at
org.apache.maven.lifecycle.internal.builder.singlethreaded.SingleThreadedBuilder.build(SingleThreadedBuilder.java:51)
        at
org.apache.maven.lifecycle.internal.LifecycleStarter.execute(LifecycleStarter.java:128)
        at org.apache.maven.DefaultMaven.doExecute(DefaultMaven.java:307)
        at org.apache.maven.DefaultMaven.doExecute(DefaultMaven.java:193)
        at org.apache.maven.DefaultMaven.execute(DefaultMaven.java:106)
        at org.apache.maven.cli.MavenCli.execute(MavenCli.java:862)
        at org.apache.maven.cli.MavenCli.doMain(MavenCli.java:286)
        at org.apache.maven.cli.MavenCli.main(MavenCli.java:197)
        at sun.reflect.NativeMethodAccessorImpl.invoke0(Native Method)
        at
sun.reflect.NativeMethodAccessorImpl.invoke(NativeMethodAccessorImpl.java:57)
        at
sun.reflect.DelegatingMethodAccessorImpl.invoke(DelegatingMethodAccessorImpl.java:43)
        at java.lang.reflect.Method.invoke(Method.java:606)
        at
org.codehaus.plexus.classworlds.launcher.Launcher.launchEnhanced(Launcher.java:289)
        at
org.codehaus.plexus.classworlds.launcher.Launcher.launch(Launcher.java:229)
        at
org.codehaus.plexus.classworlds.launcher.Launcher.mainWithExitCode(Launcher.java:415)
        at
org.codehaus.plexus.classworlds.launcher.Launcher.main(Launcher.java:356)

Which IIRC is a known problem with Maven. Has any one else seen this?

The build completes with a "BUILD SUCCESS" but the JIRA Report page is
blank. I'll have to try with an older version of Maven later...

Using:

Apache Maven 3.3.1 (cab6659f9874fa96462afef40fcf6bc033d58c1c;
2015-03-13T13:10:27-07:00)
Maven home: C:\Java\apache-maven-3.3.1
Java version: 1.7.0_75, vendor: Oracle Corporation
Java home: C:\Program Files\Java\jdk1.7.0_75\jre
Default locale: en_US, platform encoding: Cp1252
OS name: "windows 7", version: "6.1", arch: "amd64", family: "windows"

Gary

On Mon, Apr 13, 2015 at 5:28 AM, luc <[hidden email]> wrote:

> +1 from myself.
>
> Luc
>
>
> Le 2015-04-13 00:02, Bruno P. Kinoshita a écrit :
>
>> +1 non binding.
>>
>> Build works fine in the following environment
>> Apache Maven 3.2.5 (12a6b3acb947671f09b81f49094c53f426d8cea1;
>> 2014-12-15T06:29:23+13:00)
>> Maven home: /opt/apache-maven-3.2.5
>> Java version: 1.8.0_40, vendor: Oracle Corporation
>> Java home: /usr/lib/jvm/java-8-oracle/jre
>> Default locale: en_US, platform encoding: UTF-8
>> OS name: "linux", version: "3.16.0-34-generic", arch: "amd64", family:
>> "unix"
>>
>> Site generated corrected with the right version. All tests pass, 37
>> skipped. No new checkstyle errors, no new PMD errors (one was fixed I
>> think), and no new findbugs errors as well.
>> CheersBruno
>>
>>
>>       From: Luc Maisonobe <[hidden email]>
>>  To: Commons Developers List <[hidden email]>
>>  Sent: Monday, April 13, 2015 6:38 AM
>>  Subject: [VOTE][RC1] Release Apache Commons Math 3.5
>>
>> This is a [VOTE] for releasing Apache Commons Math 3.5 from release
>> candidate 1.
>>
>> Tag name: MATH_3_5_RC1 (signature can be checked from git using 'git tag
>> -v')
>>
>> Tag URL:
>>
>> <https://git-wip-us.apache.org/repos/asf?p=commons-math.git;a=commit;h=
>> 7efda3f0a0941362e9e4152d0e0e92872a8ce8d3>
>>
>> Commit ID the tag points at: 7efda3f0a0941362e9e4152d0e0e92872a8ce8d3
>>
>> Site: <http://people.apache.org/~luc/commons-math-3.5-RC1-site>
>>
>> Distribution files: https://dist.apache.org/repos/dist/dev/commons/math/
>>
>> Distribution files hashes (SHA1):
>> 3a06c6297f4975b6a5f32bacdfad126c8cec94b7 commons-math3-3.5-bin.tar.gz
>> 2873864620239f4a3efd3d088f06fbd2d533b224 commons-math3-3.5-bin.zip
>> 7ff72a98ea2da18dda7846adc699a18893b8c26b commons-math3-3.5-src.tar.gz
>> 2838050ebe95fb5456e1eca15af1e005b08011fa commons-math3-3.5-src.zip
>>
>> The svn commit revision for the distribution files above is r8586.
>>
>> KEYS file to check signatures: http://www.apache.org/dist/commons/KEYS
>>
>> Maven artifacts:
>>
>> <https://repository.apache.org/content/repositories/
>> orgapachecommons-1087/org/apache/commons/commons-math3/3.5/>
>>
>> [ ] +1 Release it.
>> [ ] +0 Go ahead; I don't care.
>> [ ] -0 There are a few minor glitches: ...
>> [ ] -1 No, do not release it because ...
>>
>> This vote will close in 72 hours, at 2015-04-15T19:00:00Z (this is UTC
>> time).
>>
>>
>> ---------------------------------------------------------------------
>> To unsubscribe, e-mail: [hidden email]
>> For additional commands, e-mail: [hidden email]
>>
>
> ---------------------------------------------------------------------
> To unsubscribe, e-mail: [hidden email]
> For additional commands, e-mail: [hidden email]
>
>


--
E-Mail: [hidden email] | [hidden email]
Java Persistence with Hibernate, Second Edition
<http://www.manning.com/bauer3/>
JUnit in Action, Second Edition <http://www.manning.com/tahchiev/>
Spring Batch in Action <http://www.manning.com/templier/>
Blog: http://garygregory.wordpress.com
Home: http://garygregory.com/
Tweet! http://twitter.com/GaryGregory
Reply | Threaded
Open this post in threaded view
|

Re: [VOTE][RC1] Release Apache Commons Math 3.5

Luc Maisonobe-2
Le 13/04/2015 18:15, Gary Gregory a écrit :
> When I build from the src zip, I get a bunch of:
>
> [ERROR]
> java.lang.IllegalArgumentException: One of setGitDir or setWorkTree must be
> called.

Yes, it is caused by the buildnumber plugin that cannot find the git
commit since you are not in a git tree.

It does not prevent the build from working and provides consistent
results, but I agree it is weird.

So do you +1 or not ?

Luc

>         at
> org.eclipse.jgit.lib.BaseRepositoryBuilder.requireGitDirOrWorkTree(BaseRepositoryBuilder.java:582)
>         at
> org.eclipse.jgit.lib.BaseRepositoryBuilder.setup(BaseRepositoryBuilder.java:550)
>         at
> org.eclipse.jgit.storage.file.FileRepositoryBuilder.build(FileRepositoryBuilder.java:89)
>         at
> ru.concerteza.util.buildnumber.BuildNumberExtractor.extract(BuildNumberExtractor.java:38)
>         at
> ru.concerteza.util.buildnumber.JGitBuildNumberMojo.execute(JGitBuildNumberMojo.java:124)
>         at
> org.apache.maven.plugin.DefaultBuildPluginManager.executeMojo(DefaultBuildPluginManager.java:134)
>         at
> org.apache.maven.lifecycle.internal.MojoExecutor.execute(MojoExecutor.java:208)
>         at
> org.apache.maven.lifecycle.internal.MojoExecutor.execute(MojoExecutor.java:153)
>         at
> org.apache.maven.lifecycle.internal.MojoExecutor.execute(MojoExecutor.java:145)
>         at
> org.apache.maven.lifecycle.internal.MojoExecutor.executeForkedExecutions(MojoExecutor.java:364)
>         at
> org.apache.maven.lifecycle.DefaultLifecycleExecutor.executeForkedExecutions(DefaultLifecycleExecutor.java:173)
>         at
> org.apache.maven.reporting.exec.DefaultMavenReportExecutor.buildReportPlugin(DefaultMavenReportExecutor.java:273)
>         at
> org.apache.maven.reporting.exec.DefaultMavenReportExecutor.buildMavenReports(DefaultMavenReportExecutor.java:154)
>         at
> org.apache.maven.plugins.site.AbstractSiteRenderingMojo.getReports(AbstractSiteRenderingMojo.java:235)
>         at org.apache.maven.plugins.site.SiteMojo.execute(SiteMojo.java:121)
>         at
> org.apache.maven.plugin.DefaultBuildPluginManager.executeMojo(DefaultBuildPluginManager.java:134)
>         at
> org.apache.maven.lifecycle.internal.MojoExecutor.execute(MojoExecutor.java:208)
>         at
> org.apache.maven.lifecycle.internal.MojoExecutor.execute(MojoExecutor.java:153)
>         at
> org.apache.maven.lifecycle.internal.MojoExecutor.execute(MojoExecutor.java:145)
>         at
> org.apache.maven.lifecycle.internal.LifecycleModuleBuilder.buildProject(LifecycleModuleBuilder.java:116)
>         at
> org.apache.maven.lifecycle.internal.LifecycleModuleBuilder.buildProject(LifecycleModuleBuilder.java:80)
>         at
> org.apache.maven.lifecycle.internal.builder.singlethreaded.SingleThreadedBuilder.build(SingleThreadedBuilder.java:51)
>         at
> org.apache.maven.lifecycle.internal.LifecycleStarter.execute(LifecycleStarter.java:128)
>         at org.apache.maven.DefaultMaven.doExecute(DefaultMaven.java:307)
>         at org.apache.maven.DefaultMaven.doExecute(DefaultMaven.java:193)
>         at org.apache.maven.DefaultMaven.execute(DefaultMaven.java:106)
>         at org.apache.maven.cli.MavenCli.execute(MavenCli.java:862)
>         at org.apache.maven.cli.MavenCli.doMain(MavenCli.java:286)
>         at org.apache.maven.cli.MavenCli.main(MavenCli.java:197)
>         at sun.reflect.NativeMethodAccessorImpl.invoke0(Native Method)
>         at
> sun.reflect.NativeMethodAccessorImpl.invoke(NativeMethodAccessorImpl.java:57)
>         at
> sun.reflect.DelegatingMethodAccessorImpl.invoke(DelegatingMethodAccessorImpl.java:43)
>         at java.lang.reflect.Method.invoke(Method.java:606)
>         at
> org.codehaus.plexus.classworlds.launcher.Launcher.launchEnhanced(Launcher.java:289)
>         at
> org.codehaus.plexus.classworlds.launcher.Launcher.launch(Launcher.java:229)
>         at
> org.codehaus.plexus.classworlds.launcher.Launcher.mainWithExitCode(Launcher.java:415)
>         at
> org.codehaus.plexus.classworlds.launcher.Launcher.main(Launcher.java:356)
>
> and one:
>
> [WARN] An issue has occurred with report
> org.apache.maven.plugin.jira.JiraMojo, skip LinkageError
> org.slf4j.spi.LocationAwareLogger.log(Lorg/slf4j/Marker;Ljava/lang/String;ILjava/lang/String;Ljava/lang/Throwable;)V,
> please report an issue to Maven dev team.
> java.lang.NoSuchMethodError:
> org.slf4j.spi.LocationAwareLogger.log(Lorg/slf4j/Marker;Ljava/lang/String;ILjava/lang/String;Ljava/lang/Throwable;)V
>         at
> org.apache.commons.logging.impl.SLF4JLocationAwareLog.trace(SLF4JLocationAwareLog.java:99)
>         at
> org.apache.commons.httpclient.methods.GetMethod.<init>(GetMethod.java:89)
>         at
> org.apache.maven.plugin.jira.ClassicJiraDownloader.download(ClassicJiraDownloader.java:364)
>         at
> org.apache.maven.plugin.jira.ClassicJiraDownloader.doExecute(ClassicJiraDownloader.java:123)
>         at
> org.apache.maven.plugin.jira.AdaptiveJiraDownloader.doExecute(AdaptiveJiraDownloader.java:54)
>         at
> org.apache.maven.plugin.jira.JiraMojo.executeReport(JiraMojo.java:367)
>         at
> org.apache.maven.reporting.AbstractMavenReport.generate(AbstractMavenReport.java:190)
>         at
> org.apache.maven.plugins.site.ReportDocumentRenderer.renderDocument(ReportDocumentRenderer.java:219)
>         at
> org.apache.maven.doxia.siterenderer.DefaultSiteRenderer.renderModule(DefaultSiteRenderer.java:319)
>         at
> org.apache.maven.doxia.siterenderer.DefaultSiteRenderer.render(DefaultSiteRenderer.java:135)
>         at
> org.apache.maven.plugins.site.SiteMojo.renderLocale(SiteMojo.java:175)
>         at org.apache.maven.plugins.site.SiteMojo.execute(SiteMojo.java:138)
>         at
> org.apache.maven.plugin.DefaultBuildPluginManager.executeMojo(DefaultBuildPluginManager.java:134)
>         at
> org.apache.maven.lifecycle.internal.MojoExecutor.execute(MojoExecutor.java:208)
>         at
> org.apache.maven.lifecycle.internal.MojoExecutor.execute(MojoExecutor.java:153)
>         at
> org.apache.maven.lifecycle.internal.MojoExecutor.execute(MojoExecutor.java:145)
>         at
> org.apache.maven.lifecycle.internal.LifecycleModuleBuilder.buildProject(LifecycleModuleBuilder.java:116)
>         at
> org.apache.maven.lifecycle.internal.LifecycleModuleBuilder.buildProject(LifecycleModuleBuilder.java:80)
>         at
> org.apache.maven.lifecycle.internal.builder.singlethreaded.SingleThreadedBuilder.build(SingleThreadedBuilder.java:51)
>         at
> org.apache.maven.lifecycle.internal.LifecycleStarter.execute(LifecycleStarter.java:128)
>         at org.apache.maven.DefaultMaven.doExecute(DefaultMaven.java:307)
>         at org.apache.maven.DefaultMaven.doExecute(DefaultMaven.java:193)
>         at org.apache.maven.DefaultMaven.execute(DefaultMaven.java:106)
>         at org.apache.maven.cli.MavenCli.execute(MavenCli.java:862)
>         at org.apache.maven.cli.MavenCli.doMain(MavenCli.java:286)
>         at org.apache.maven.cli.MavenCli.main(MavenCli.java:197)
>         at sun.reflect.NativeMethodAccessorImpl.invoke0(Native Method)
>         at
> sun.reflect.NativeMethodAccessorImpl.invoke(NativeMethodAccessorImpl.java:57)
>         at
> sun.reflect.DelegatingMethodAccessorImpl.invoke(DelegatingMethodAccessorImpl.java:43)
>         at java.lang.reflect.Method.invoke(Method.java:606)
>         at
> org.codehaus.plexus.classworlds.launcher.Launcher.launchEnhanced(Launcher.java:289)
>         at
> org.codehaus.plexus.classworlds.launcher.Launcher.launch(Launcher.java:229)
>         at
> org.codehaus.plexus.classworlds.launcher.Launcher.mainWithExitCode(Launcher.java:415)
>         at
> org.codehaus.plexus.classworlds.launcher.Launcher.main(Launcher.java:356)
>
> Which IIRC is a known problem with Maven. Has any one else seen this?
>
> The build completes with a "BUILD SUCCESS" but the JIRA Report page is
> blank. I'll have to try with an older version of Maven later...
>
> Using:
>
> Apache Maven 3.3.1 (cab6659f9874fa96462afef40fcf6bc033d58c1c;
> 2015-03-13T13:10:27-07:00)
> Maven home: C:\Java\apache-maven-3.3.1
> Java version: 1.7.0_75, vendor: Oracle Corporation
> Java home: C:\Program Files\Java\jdk1.7.0_75\jre
> Default locale: en_US, platform encoding: Cp1252
> OS name: "windows 7", version: "6.1", arch: "amd64", family: "windows"
>
> Gary
>
> On Mon, Apr 13, 2015 at 5:28 AM, luc <[hidden email]> wrote:
>
>> +1 from myself.
>>
>> Luc
>>
>>
>> Le 2015-04-13 00:02, Bruno P. Kinoshita a écrit :
>>
>>> +1 non binding.
>>>
>>> Build works fine in the following environment
>>> Apache Maven 3.2.5 (12a6b3acb947671f09b81f49094c53f426d8cea1;
>>> 2014-12-15T06:29:23+13:00)
>>> Maven home: /opt/apache-maven-3.2.5
>>> Java version: 1.8.0_40, vendor: Oracle Corporation
>>> Java home: /usr/lib/jvm/java-8-oracle/jre
>>> Default locale: en_US, platform encoding: UTF-8
>>> OS name: "linux", version: "3.16.0-34-generic", arch: "amd64", family:
>>> "unix"
>>>
>>> Site generated corrected with the right version. All tests pass, 37
>>> skipped. No new checkstyle errors, no new PMD errors (one was fixed I
>>> think), and no new findbugs errors as well.
>>> CheersBruno
>>>
>>>
>>>       From: Luc Maisonobe <[hidden email]>
>>>  To: Commons Developers List <[hidden email]>
>>>  Sent: Monday, April 13, 2015 6:38 AM
>>>  Subject: [VOTE][RC1] Release Apache Commons Math 3.5
>>>
>>> This is a [VOTE] for releasing Apache Commons Math 3.5 from release
>>> candidate 1.
>>>
>>> Tag name: MATH_3_5_RC1 (signature can be checked from git using 'git tag
>>> -v')
>>>
>>> Tag URL:
>>>
>>> <https://git-wip-us.apache.org/repos/asf?p=commons-math.git;a=commit;h=
>>> 7efda3f0a0941362e9e4152d0e0e92872a8ce8d3>
>>>
>>> Commit ID the tag points at: 7efda3f0a0941362e9e4152d0e0e92872a8ce8d3
>>>
>>> Site: <http://people.apache.org/~luc/commons-math-3.5-RC1-site>
>>>
>>> Distribution files: https://dist.apache.org/repos/dist/dev/commons/math/
>>>
>>> Distribution files hashes (SHA1):
>>> 3a06c6297f4975b6a5f32bacdfad126c8cec94b7 commons-math3-3.5-bin.tar.gz
>>> 2873864620239f4a3efd3d088f06fbd2d533b224 commons-math3-3.5-bin.zip
>>> 7ff72a98ea2da18dda7846adc699a18893b8c26b commons-math3-3.5-src.tar.gz
>>> 2838050ebe95fb5456e1eca15af1e005b08011fa commons-math3-3.5-src.zip
>>>
>>> The svn commit revision for the distribution files above is r8586.
>>>
>>> KEYS file to check signatures: http://www.apache.org/dist/commons/KEYS
>>>
>>> Maven artifacts:
>>>
>>> <https://repository.apache.org/content/repositories/
>>> orgapachecommons-1087/org/apache/commons/commons-math3/3.5/>
>>>
>>> [ ] +1 Release it.
>>> [ ] +0 Go ahead; I don't care.
>>> [ ] -0 There are a few minor glitches: ...
>>> [ ] -1 No, do not release it because ...
>>>
>>> This vote will close in 72 hours, at 2015-04-15T19:00:00Z (this is UTC
>>> time).
>>>
>>>
>>> ---------------------------------------------------------------------
>>> To unsubscribe, e-mail: [hidden email]
>>> For additional commands, e-mail: [hidden email]
>>>
>>
>> ---------------------------------------------------------------------
>> To unsubscribe, e-mail: [hidden email]
>> For additional commands, e-mail: [hidden email]
>>
>>
>
>


---------------------------------------------------------------------
To unsubscribe, e-mail: [hidden email]
For additional commands, e-mail: [hidden email]

Reply | Threaded
Open this post in threaded view
|

Re: [VOTE][RC1] Release Apache Commons Math 3.5

garydgregory
On Mon, Apr 13, 2015 at 10:51 AM, Luc Maisonobe <[hidden email]> wrote:

> Le 13/04/2015 18:15, Gary Gregory a écrit :
> > When I build from the src zip, I get a bunch of:
> >
> > [ERROR]
> > java.lang.IllegalArgumentException: One of setGitDir or setWorkTree must
> be
> > called.
>
> Yes, it is caused by the buildnumber plugin that cannot find the git
> commit since you are not in a git tree.
>
> It does not prevent the build from working and provides consistent
> results, but I agree it is weird.
>
> So do you +1 or not ?
>

I am busy ATM, sorry, I'll rerun later.
Gary

>
> Luc
>
> >         at
> >
> org.eclipse.jgit.lib.BaseRepositoryBuilder.requireGitDirOrWorkTree(BaseRepositoryBuilder.java:582)
> >         at
> >
> org.eclipse.jgit.lib.BaseRepositoryBuilder.setup(BaseRepositoryBuilder.java:550)
> >         at
> >
> org.eclipse.jgit.storage.file.FileRepositoryBuilder.build(FileRepositoryBuilder.java:89)
> >         at
> >
> ru.concerteza.util.buildnumber.BuildNumberExtractor.extract(BuildNumberExtractor.java:38)
> >         at
> >
> ru.concerteza.util.buildnumber.JGitBuildNumberMojo.execute(JGitBuildNumberMojo.java:124)
> >         at
> >
> org.apache.maven.plugin.DefaultBuildPluginManager.executeMojo(DefaultBuildPluginManager.java:134)
> >         at
> >
> org.apache.maven.lifecycle.internal.MojoExecutor.execute(MojoExecutor.java:208)
> >         at
> >
> org.apache.maven.lifecycle.internal.MojoExecutor.execute(MojoExecutor.java:153)
> >         at
> >
> org.apache.maven.lifecycle.internal.MojoExecutor.execute(MojoExecutor.java:145)
> >         at
> >
> org.apache.maven.lifecycle.internal.MojoExecutor.executeForkedExecutions(MojoExecutor.java:364)
> >         at
> >
> org.apache.maven.lifecycle.DefaultLifecycleExecutor.executeForkedExecutions(DefaultLifecycleExecutor.java:173)
> >         at
> >
> org.apache.maven.reporting.exec.DefaultMavenReportExecutor.buildReportPlugin(DefaultMavenReportExecutor.java:273)
> >         at
> >
> org.apache.maven.reporting.exec.DefaultMavenReportExecutor.buildMavenReports(DefaultMavenReportExecutor.java:154)
> >         at
> >
> org.apache.maven.plugins.site.AbstractSiteRenderingMojo.getReports(AbstractSiteRenderingMojo.java:235)
> >         at
> org.apache.maven.plugins.site.SiteMojo.execute(SiteMojo.java:121)
> >         at
> >
> org.apache.maven.plugin.DefaultBuildPluginManager.executeMojo(DefaultBuildPluginManager.java:134)
> >         at
> >
> org.apache.maven.lifecycle.internal.MojoExecutor.execute(MojoExecutor.java:208)
> >         at
> >
> org.apache.maven.lifecycle.internal.MojoExecutor.execute(MojoExecutor.java:153)
> >         at
> >
> org.apache.maven.lifecycle.internal.MojoExecutor.execute(MojoExecutor.java:145)
> >         at
> >
> org.apache.maven.lifecycle.internal.LifecycleModuleBuilder.buildProject(LifecycleModuleBuilder.java:116)
> >         at
> >
> org.apache.maven.lifecycle.internal.LifecycleModuleBuilder.buildProject(LifecycleModuleBuilder.java:80)
> >         at
> >
> org.apache.maven.lifecycle.internal.builder.singlethreaded.SingleThreadedBuilder.build(SingleThreadedBuilder.java:51)
> >         at
> >
> org.apache.maven.lifecycle.internal.LifecycleStarter.execute(LifecycleStarter.java:128)
> >         at org.apache.maven.DefaultMaven.doExecute(DefaultMaven.java:307)
> >         at org.apache.maven.DefaultMaven.doExecute(DefaultMaven.java:193)
> >         at org.apache.maven.DefaultMaven.execute(DefaultMaven.java:106)
> >         at org.apache.maven.cli.MavenCli.execute(MavenCli.java:862)
> >         at org.apache.maven.cli.MavenCli.doMain(MavenCli.java:286)
> >         at org.apache.maven.cli.MavenCli.main(MavenCli.java:197)
> >         at sun.reflect.NativeMethodAccessorImpl.invoke0(Native Method)
> >         at
> >
> sun.reflect.NativeMethodAccessorImpl.invoke(NativeMethodAccessorImpl.java:57)
> >         at
> >
> sun.reflect.DelegatingMethodAccessorImpl.invoke(DelegatingMethodAccessorImpl.java:43)
> >         at java.lang.reflect.Method.invoke(Method.java:606)
> >         at
> >
> org.codehaus.plexus.classworlds.launcher.Launcher.launchEnhanced(Launcher.java:289)
> >         at
> >
> org.codehaus.plexus.classworlds.launcher.Launcher.launch(Launcher.java:229)
> >         at
> >
> org.codehaus.plexus.classworlds.launcher.Launcher.mainWithExitCode(Launcher.java:415)
> >         at
> > org.codehaus.plexus.classworlds.launcher.Launcher.main(Launcher.java:356)
> >
> > and one:
> >
> > [WARN] An issue has occurred with report
> > org.apache.maven.plugin.jira.JiraMojo, skip LinkageError
> >
> org.slf4j.spi.LocationAwareLogger.log(Lorg/slf4j/Marker;Ljava/lang/String;ILjava/lang/String;Ljava/lang/Throwable;)V,
> > please report an issue to Maven dev team.
> > java.lang.NoSuchMethodError:
> >
> org.slf4j.spi.LocationAwareLogger.log(Lorg/slf4j/Marker;Ljava/lang/String;ILjava/lang/String;Ljava/lang/Throwable;)V
> >         at
> >
> org.apache.commons.logging.impl.SLF4JLocationAwareLog.trace(SLF4JLocationAwareLog.java:99)
> >         at
> > org.apache.commons.httpclient.methods.GetMethod.<init>(GetMethod.java:89)
> >         at
> >
> org.apache.maven.plugin.jira.ClassicJiraDownloader.download(ClassicJiraDownloader.java:364)
> >         at
> >
> org.apache.maven.plugin.jira.ClassicJiraDownloader.doExecute(ClassicJiraDownloader.java:123)
> >         at
> >
> org.apache.maven.plugin.jira.AdaptiveJiraDownloader.doExecute(AdaptiveJiraDownloader.java:54)
> >         at
> > org.apache.maven.plugin.jira.JiraMojo.executeReport(JiraMojo.java:367)
> >         at
> >
> org.apache.maven.reporting.AbstractMavenReport.generate(AbstractMavenReport.java:190)
> >         at
> >
> org.apache.maven.plugins.site.ReportDocumentRenderer.renderDocument(ReportDocumentRenderer.java:219)
> >         at
> >
> org.apache.maven.doxia.siterenderer.DefaultSiteRenderer.renderModule(DefaultSiteRenderer.java:319)
> >         at
> >
> org.apache.maven.doxia.siterenderer.DefaultSiteRenderer.render(DefaultSiteRenderer.java:135)
> >         at
> > org.apache.maven.plugins.site.SiteMojo.renderLocale(SiteMojo.java:175)
> >         at
> org.apache.maven.plugins.site.SiteMojo.execute(SiteMojo.java:138)
> >         at
> >
> org.apache.maven.plugin.DefaultBuildPluginManager.executeMojo(DefaultBuildPluginManager.java:134)
> >         at
> >
> org.apache.maven.lifecycle.internal.MojoExecutor.execute(MojoExecutor.java:208)
> >         at
> >
> org.apache.maven.lifecycle.internal.MojoExecutor.execute(MojoExecutor.java:153)
> >         at
> >
> org.apache.maven.lifecycle.internal.MojoExecutor.execute(MojoExecutor.java:145)
> >         at
> >
> org.apache.maven.lifecycle.internal.LifecycleModuleBuilder.buildProject(LifecycleModuleBuilder.java:116)
> >         at
> >
> org.apache.maven.lifecycle.internal.LifecycleModuleBuilder.buildProject(LifecycleModuleBuilder.java:80)
> >         at
> >
> org.apache.maven.lifecycle.internal.builder.singlethreaded.SingleThreadedBuilder.build(SingleThreadedBuilder.java:51)
> >         at
> >
> org.apache.maven.lifecycle.internal.LifecycleStarter.execute(LifecycleStarter.java:128)
> >         at org.apache.maven.DefaultMaven.doExecute(DefaultMaven.java:307)
> >         at org.apache.maven.DefaultMaven.doExecute(DefaultMaven.java:193)
> >         at org.apache.maven.DefaultMaven.execute(DefaultMaven.java:106)
> >         at org.apache.maven.cli.MavenCli.execute(MavenCli.java:862)
> >         at org.apache.maven.cli.MavenCli.doMain(MavenCli.java:286)
> >         at org.apache.maven.cli.MavenCli.main(MavenCli.java:197)
> >         at sun.reflect.NativeMethodAccessorImpl.invoke0(Native Method)
> >         at
> >
> sun.reflect.NativeMethodAccessorImpl.invoke(NativeMethodAccessorImpl.java:57)
> >         at
> >
> sun.reflect.DelegatingMethodAccessorImpl.invoke(DelegatingMethodAccessorImpl.java:43)
> >         at java.lang.reflect.Method.invoke(Method.java:606)
> >         at
> >
> org.codehaus.plexus.classworlds.launcher.Launcher.launchEnhanced(Launcher.java:289)
> >         at
> >
> org.codehaus.plexus.classworlds.launcher.Launcher.launch(Launcher.java:229)
> >         at
> >
> org.codehaus.plexus.classworlds.launcher.Launcher.mainWithExitCode(Launcher.java:415)
> >         at
> > org.codehaus.plexus.classworlds.launcher.Launcher.main(Launcher.java:356)
> >
> > Which IIRC is a known problem with Maven. Has any one else seen this?
> >
> > The build completes with a "BUILD SUCCESS" but the JIRA Report page is
> > blank. I'll have to try with an older version of Maven later...
> >
> > Using:
> >
> > Apache Maven 3.3.1 (cab6659f9874fa96462afef40fcf6bc033d58c1c;
> > 2015-03-13T13:10:27-07:00)
> > Maven home: C:\Java\apache-maven-3.3.1
> > Java version: 1.7.0_75, vendor: Oracle Corporation
> > Java home: C:\Program Files\Java\jdk1.7.0_75\jre
> > Default locale: en_US, platform encoding: Cp1252
> > OS name: "windows 7", version: "6.1", arch: "amd64", family: "windows"
> >
> > Gary
> >
> > On Mon, Apr 13, 2015 at 5:28 AM, luc <[hidden email]> wrote:
> >
> >> +1 from myself.
> >>
> >> Luc
> >>
> >>
> >> Le 2015-04-13 00:02, Bruno P. Kinoshita a écrit :
> >>
> >>> +1 non binding.
> >>>
> >>> Build works fine in the following environment
> >>> Apache Maven 3.2.5 (12a6b3acb947671f09b81f49094c53f426d8cea1;
> >>> 2014-12-15T06:29:23+13:00)
> >>> Maven home: /opt/apache-maven-3.2.5
> >>> Java version: 1.8.0_40, vendor: Oracle Corporation
> >>> Java home: /usr/lib/jvm/java-8-oracle/jre
> >>> Default locale: en_US, platform encoding: UTF-8
> >>> OS name: "linux", version: "3.16.0-34-generic", arch: "amd64", family:
> >>> "unix"
> >>>
> >>> Site generated corrected with the right version. All tests pass, 37
> >>> skipped. No new checkstyle errors, no new PMD errors (one was fixed I
> >>> think), and no new findbugs errors as well.
> >>> CheersBruno
> >>>
> >>>
> >>>       From: Luc Maisonobe <[hidden email]>
> >>>  To: Commons Developers List <[hidden email]>
> >>>  Sent: Monday, April 13, 2015 6:38 AM
> >>>  Subject: [VOTE][RC1] Release Apache Commons Math 3.5
> >>>
> >>> This is a [VOTE] for releasing Apache Commons Math 3.5 from release
> >>> candidate 1.
> >>>
> >>> Tag name: MATH_3_5_RC1 (signature can be checked from git using 'git
> tag
> >>> -v')
> >>>
> >>> Tag URL:
> >>>
> >>> <
> https://git-wip-us.apache.org/repos/asf?p=commons-math.git;a=commit;h=
> >>> 7efda3f0a0941362e9e4152d0e0e92872a8ce8d3>
> >>>
> >>> Commit ID the tag points at: 7efda3f0a0941362e9e4152d0e0e92872a8ce8d3
> >>>
> >>> Site: <http://people.apache.org/~luc/commons-math-3.5-RC1-site>
> >>>
> >>> Distribution files:
> https://dist.apache.org/repos/dist/dev/commons/math/
> >>>
> >>> Distribution files hashes (SHA1):
> >>> 3a06c6297f4975b6a5f32bacdfad126c8cec94b7 commons-math3-3.5-bin.tar.gz
> >>> 2873864620239f4a3efd3d088f06fbd2d533b224 commons-math3-3.5-bin.zip
> >>> 7ff72a98ea2da18dda7846adc699a18893b8c26b commons-math3-3.5-src.tar.gz
> >>> 2838050ebe95fb5456e1eca15af1e005b08011fa commons-math3-3.5-src.zip
> >>>
> >>> The svn commit revision for the distribution files above is r8586.
> >>>
> >>> KEYS file to check signatures: http://www.apache.org/dist/commons/KEYS
> >>>
> >>> Maven artifacts:
> >>>
> >>> <https://repository.apache.org/content/repositories/
> >>> orgapachecommons-1087/org/apache/commons/commons-math3/3.5/>
> >>>
> >>> [ ] +1 Release it.
> >>> [ ] +0 Go ahead; I don't care.
> >>> [ ] -0 There are a few minor glitches: ...
> >>> [ ] -1 No, do not release it because ...
> >>>
> >>> This vote will close in 72 hours, at 2015-04-15T19:00:00Z (this is UTC
> >>> time).
> >>>
> >>>
> >>> ---------------------------------------------------------------------
> >>> To unsubscribe, e-mail: [hidden email]
> >>> For additional commands, e-mail: [hidden email]
> >>>
> >>
> >> ---------------------------------------------------------------------
> >> To unsubscribe, e-mail: [hidden email]
> >> For additional commands, e-mail: [hidden email]
> >>
> >>
> >
> >
>
>
> ---------------------------------------------------------------------
> To unsubscribe, e-mail: [hidden email]
> For additional commands, e-mail: [hidden email]
>
>


--
E-Mail: [hidden email] | [hidden email]
Java Persistence with Hibernate, Second Edition
<http://www.manning.com/bauer3/>
JUnit in Action, Second Edition <http://www.manning.com/tahchiev/>
Spring Batch in Action <http://www.manning.com/templier/>
Blog: http://garygregory.wordpress.com
Home: http://garygregory.com/
Tweet! http://twitter.com/GaryGregory
Reply | Threaded
Open this post in threaded view
|

Re: [VOTE][RC1] Release Apache Commons Math 3.5

Benedikt Ritter-4
In reply to this post by Luc Maisonobe-2
Hi,

tested with:

Apache Maven 3.3.1 (cab6659f9874fa96462afef40fcf6bc033d58c1c;
2015-03-13T21:10:27+01:00)
Maven home: /usr/local/Cellar/maven/3.3.1/libexec
Java version: 1.8.0_31, vendor: Oracle Corporation
Java home:
/Library/Java/JavaVirtualMachines/jdk1.8.0_31.jdk/Contents/Home/jre
Default locale: de_DE, platform encoding: UTF-8
OS name: "mac os x", version: "10.10.2", arch: "x86_64", family: "mac"

And Java 7 and 8.

- Build works
- Signs and hashes are good
- Site looks good
- PMD errors sound like they are easy to fix, but I don't know the math
code...
- No CPD report?

+1

Benedikt


2015-04-12 20:38 GMT+02:00 Luc Maisonobe <[hidden email]>:

> This is a [VOTE] for releasing Apache Commons Math 3.5 from release
> candidate 1.
>
> Tag name: MATH_3_5_RC1 (signature can be checked from git using 'git tag
> -v')
>
> Tag URL:
>
> <
> https://git-wip-us.apache.org/repos/asf?p=commons-math.git;a=commit;h=7efda3f0a0941362e9e4152d0e0e92872a8ce8d3
> >
>
> Commit ID the tag points at: 7efda3f0a0941362e9e4152d0e0e92872a8ce8d3
>
> Site: <http://people.apache.org/~luc/commons-math-3.5-RC1-site>
>
> Distribution files: https://dist.apache.org/repos/dist/dev/commons/math/
>
> Distribution files hashes (SHA1):
> 3a06c6297f4975b6a5f32bacdfad126c8cec94b7 commons-math3-3.5-bin.tar.gz
> 2873864620239f4a3efd3d088f06fbd2d533b224 commons-math3-3.5-bin.zip
> 7ff72a98ea2da18dda7846adc699a18893b8c26b commons-math3-3.5-src.tar.gz
> 2838050ebe95fb5456e1eca15af1e005b08011fa commons-math3-3.5-src.zip
>
> The svn commit revision for the distribution files above is r8586.
>
> KEYS file to check signatures: http://www.apache.org/dist/commons/KEYS
>
> Maven artifacts:
>
> <
> https://repository.apache.org/content/repositories/orgapachecommons-1087/org/apache/commons/commons-math3/3.5/
> >
>
> [ ] +1 Release it.
> [ ] +0 Go ahead; I don't care.
> [ ] -0 There are a few minor glitches: ...
> [ ] -1 No, do not release it because ...
>
> This vote will close in 72 hours, at 2015-04-15T19:00:00Z (this is UTC
> time).
>
>
> ---------------------------------------------------------------------
> To unsubscribe, e-mail: [hidden email]
> For additional commands, e-mail: [hidden email]
>
>


--
http://people.apache.org/~britter/
http://www.systemoutprintln.de/
http://twitter.com/BenediktRitter
http://github.com/britter
Reply | Threaded
Open this post in threaded view
|

Re: [VOTE][RC1] Release Apache Commons Math 3.5

garydgregory
In reply to this post by garydgregory
+1.

Tested with src zip; MD5, ASC OK. Site builds (including JIRA report, which
fails with Maven 3.3.1.). Reports looks good. Can't attest if PMD and
Checkstyle are better or worse than previous release though.

Tested with:

Apache Maven 3.2.5 (12a6b3acb947671f09b81f49094c53f426d8cea1;
2014-12-14T09:29:23-08:00)
Maven home: C:\Java\apache-maven-3.2.5
Java version: 1.7.0_75, vendor: Oracle Corporation
Java home: C:\Program Files\Java\jdk1.7.0_75\jre
Default locale: en_US, platform encoding: Cp1252
OS name: "windows 7", version: "6.1", arch: "amd64", family: "windows"

The tests print noise on the console, not a blocker of course:

>>testExpInf4()
inf=-Infinity
intval=2147483647
neginf<0=true
expReal=0.0
cosImag=0.5403023058681398
sinImag=0.8414709848078965
result=(0.0, 0.0)
<<testExpInf4()
>>testJava()
Math.exp=0.0
java.version=1.7.0_75
java.vendor=Oracle Corporation
java.vm.specification.version=1.7
java.vm.specification.vendor=Oracle Corporation
java.vm.specification.name=Java Virtual Machine Specification
java.vm.version=24.75-b04
java.vm.vendor=Oracle Corporation
java.vm.name=Java HotSpot(TM) 64-Bit Server VM
java.specification.version=1.7
java.specification.vendor=Oracle Corporation
java.specification.name=Java Platform API Specification
java.class.version=51.0
<<testJava()

Gary

On Mon, Apr 13, 2015 at 10:55 AM, Gary Gregory <[hidden email]>
wrote:

>
> On Mon, Apr 13, 2015 at 10:51 AM, Luc Maisonobe <[hidden email]>
> wrote:
>
>> Le 13/04/2015 18:15, Gary Gregory a écrit :
>> > When I build from the src zip, I get a bunch of:
>> >
>> > [ERROR]
>> > java.lang.IllegalArgumentException: One of setGitDir or setWorkTree
>> must be
>> > called.
>>
>> Yes, it is caused by the buildnumber plugin that cannot find the git
>> commit since you are not in a git tree.
>>
>> It does not prevent the build from working and provides consistent
>> results, but I agree it is weird.
>>
>> So do you +1 or not ?
>>
>
> I am busy ATM, sorry, I'll rerun later.
> Gary
>
>>
>> Luc
>>
>> >         at
>> >
>> org.eclipse.jgit.lib.BaseRepositoryBuilder.requireGitDirOrWorkTree(BaseRepositoryBuilder.java:582)
>> >         at
>> >
>> org.eclipse.jgit.lib.BaseRepositoryBuilder.setup(BaseRepositoryBuilder.java:550)
>> >         at
>> >
>> org.eclipse.jgit.storage.file.FileRepositoryBuilder.build(FileRepositoryBuilder.java:89)
>> >         at
>> >
>> ru.concerteza.util.buildnumber.BuildNumberExtractor.extract(BuildNumberExtractor.java:38)
>> >         at
>> >
>> ru.concerteza.util.buildnumber.JGitBuildNumberMojo.execute(JGitBuildNumberMojo.java:124)
>> >         at
>> >
>> org.apache.maven.plugin.DefaultBuildPluginManager.executeMojo(DefaultBuildPluginManager.java:134)
>> >         at
>> >
>> org.apache.maven.lifecycle.internal.MojoExecutor.execute(MojoExecutor.java:208)
>> >         at
>> >
>> org.apache.maven.lifecycle.internal.MojoExecutor.execute(MojoExecutor.java:153)
>> >         at
>> >
>> org.apache.maven.lifecycle.internal.MojoExecutor.execute(MojoExecutor.java:145)
>> >         at
>> >
>> org.apache.maven.lifecycle.internal.MojoExecutor.executeForkedExecutions(MojoExecutor.java:364)
>> >         at
>> >
>> org.apache.maven.lifecycle.DefaultLifecycleExecutor.executeForkedExecutions(DefaultLifecycleExecutor.java:173)
>> >         at
>> >
>> org.apache.maven.reporting.exec.DefaultMavenReportExecutor.buildReportPlugin(DefaultMavenReportExecutor.java:273)
>> >         at
>> >
>> org.apache.maven.reporting.exec.DefaultMavenReportExecutor.buildMavenReports(DefaultMavenReportExecutor.java:154)
>> >         at
>> >
>> org.apache.maven.plugins.site.AbstractSiteRenderingMojo.getReports(AbstractSiteRenderingMojo.java:235)
>> >         at
>> org.apache.maven.plugins.site.SiteMojo.execute(SiteMojo.java:121)
>> >         at
>> >
>> org.apache.maven.plugin.DefaultBuildPluginManager.executeMojo(DefaultBuildPluginManager.java:134)
>> >         at
>> >
>> org.apache.maven.lifecycle.internal.MojoExecutor.execute(MojoExecutor.java:208)
>> >         at
>> >
>> org.apache.maven.lifecycle.internal.MojoExecutor.execute(MojoExecutor.java:153)
>> >         at
>> >
>> org.apache.maven.lifecycle.internal.MojoExecutor.execute(MojoExecutor.java:145)
>> >         at
>> >
>> org.apache.maven.lifecycle.internal.LifecycleModuleBuilder.buildProject(LifecycleModuleBuilder.java:116)
>> >         at
>> >
>> org.apache.maven.lifecycle.internal.LifecycleModuleBuilder.buildProject(LifecycleModuleBuilder.java:80)
>> >         at
>> >
>> org.apache.maven.lifecycle.internal.builder.singlethreaded.SingleThreadedBuilder.build(SingleThreadedBuilder.java:51)
>> >         at
>> >
>> org.apache.maven.lifecycle.internal.LifecycleStarter.execute(LifecycleStarter.java:128)
>> >         at
>> org.apache.maven.DefaultMaven.doExecute(DefaultMaven.java:307)
>> >         at
>> org.apache.maven.DefaultMaven.doExecute(DefaultMaven.java:193)
>> >         at org.apache.maven.DefaultMaven.execute(DefaultMaven.java:106)
>> >         at org.apache.maven.cli.MavenCli.execute(MavenCli.java:862)
>> >         at org.apache.maven.cli.MavenCli.doMain(MavenCli.java:286)
>> >         at org.apache.maven.cli.MavenCli.main(MavenCli.java:197)
>> >         at sun.reflect.NativeMethodAccessorImpl.invoke0(Native Method)
>> >         at
>> >
>> sun.reflect.NativeMethodAccessorImpl.invoke(NativeMethodAccessorImpl.java:57)
>> >         at
>> >
>> sun.reflect.DelegatingMethodAccessorImpl.invoke(DelegatingMethodAccessorImpl.java:43)
>> >         at java.lang.reflect.Method.invoke(Method.java:606)
>> >         at
>> >
>> org.codehaus.plexus.classworlds.launcher.Launcher.launchEnhanced(Launcher.java:289)
>> >         at
>> >
>> org.codehaus.plexus.classworlds.launcher.Launcher.launch(Launcher.java:229)
>> >         at
>> >
>> org.codehaus.plexus.classworlds.launcher.Launcher.mainWithExitCode(Launcher.java:415)
>> >         at
>> >
>> org.codehaus.plexus.classworlds.launcher.Launcher.main(Launcher.java:356)
>> >
>> > and one:
>> >
>> > [WARN] An issue has occurred with report
>> > org.apache.maven.plugin.jira.JiraMojo, skip LinkageError
>> >
>> org.slf4j.spi.LocationAwareLogger.log(Lorg/slf4j/Marker;Ljava/lang/String;ILjava/lang/String;Ljava/lang/Throwable;)V,
>> > please report an issue to Maven dev team.
>> > java.lang.NoSuchMethodError:
>> >
>> org.slf4j.spi.LocationAwareLogger.log(Lorg/slf4j/Marker;Ljava/lang/String;ILjava/lang/String;Ljava/lang/Throwable;)V
>> >         at
>> >
>> org.apache.commons.logging.impl.SLF4JLocationAwareLog.trace(SLF4JLocationAwareLog.java:99)
>> >         at
>> >
>> org.apache.commons.httpclient.methods.GetMethod.<init>(GetMethod.java:89)
>> >         at
>> >
>> org.apache.maven.plugin.jira.ClassicJiraDownloader.download(ClassicJiraDownloader.java:364)
>> >         at
>> >
>> org.apache.maven.plugin.jira.ClassicJiraDownloader.doExecute(ClassicJiraDownloader.java:123)
>> >         at
>> >
>> org.apache.maven.plugin.jira.AdaptiveJiraDownloader.doExecute(AdaptiveJiraDownloader.java:54)
>> >         at
>> > org.apache.maven.plugin.jira.JiraMojo.executeReport(JiraMojo.java:367)
>> >         at
>> >
>> org.apache.maven.reporting.AbstractMavenReport.generate(AbstractMavenReport.java:190)
>> >         at
>> >
>> org.apache.maven.plugins.site.ReportDocumentRenderer.renderDocument(ReportDocumentRenderer.java:219)
>> >         at
>> >
>> org.apache.maven.doxia.siterenderer.DefaultSiteRenderer.renderModule(DefaultSiteRenderer.java:319)
>> >         at
>> >
>> org.apache.maven.doxia.siterenderer.DefaultSiteRenderer.render(DefaultSiteRenderer.java:135)
>> >         at
>> > org.apache.maven.plugins.site.SiteMojo.renderLocale(SiteMojo.java:175)
>> >         at
>> org.apache.maven.plugins.site.SiteMojo.execute(SiteMojo.java:138)
>> >         at
>> >
>> org.apache.maven.plugin.DefaultBuildPluginManager.executeMojo(DefaultBuildPluginManager.java:134)
>> >         at
>> >
>> org.apache.maven.lifecycle.internal.MojoExecutor.execute(MojoExecutor.java:208)
>> >         at
>> >
>> org.apache.maven.lifecycle.internal.MojoExecutor.execute(MojoExecutor.java:153)
>> >         at
>> >
>> org.apache.maven.lifecycle.internal.MojoExecutor.execute(MojoExecutor.java:145)
>> >         at
>> >
>> org.apache.maven.lifecycle.internal.LifecycleModuleBuilder.buildProject(LifecycleModuleBuilder.java:116)
>> >         at
>> >
>> org.apache.maven.lifecycle.internal.LifecycleModuleBuilder.buildProject(LifecycleModuleBuilder.java:80)
>> >         at
>> >
>> org.apache.maven.lifecycle.internal.builder.singlethreaded.SingleThreadedBuilder.build(SingleThreadedBuilder.java:51)
>> >         at
>> >
>> org.apache.maven.lifecycle.internal.LifecycleStarter.execute(LifecycleStarter.java:128)
>> >         at
>> org.apache.maven.DefaultMaven.doExecute(DefaultMaven.java:307)
>> >         at
>> org.apache.maven.DefaultMaven.doExecute(DefaultMaven.java:193)
>> >         at org.apache.maven.DefaultMaven.execute(DefaultMaven.java:106)
>> >         at org.apache.maven.cli.MavenCli.execute(MavenCli.java:862)
>> >         at org.apache.maven.cli.MavenCli.doMain(MavenCli.java:286)
>> >         at org.apache.maven.cli.MavenCli.main(MavenCli.java:197)
>> >         at sun.reflect.NativeMethodAccessorImpl.invoke0(Native Method)
>> >         at
>> >
>> sun.reflect.NativeMethodAccessorImpl.invoke(NativeMethodAccessorImpl.java:57)
>> >         at
>> >
>> sun.reflect.DelegatingMethodAccessorImpl.invoke(DelegatingMethodAccessorImpl.java:43)
>> >         at java.lang.reflect.Method.invoke(Method.java:606)
>> >         at
>> >
>> org.codehaus.plexus.classworlds.launcher.Launcher.launchEnhanced(Launcher.java:289)
>> >         at
>> >
>> org.codehaus.plexus.classworlds.launcher.Launcher.launch(Launcher.java:229)
>> >         at
>> >
>> org.codehaus.plexus.classworlds.launcher.Launcher.mainWithExitCode(Launcher.java:415)
>> >         at
>> >
>> org.codehaus.plexus.classworlds.launcher.Launcher.main(Launcher.java:356)
>> >
>> > Which IIRC is a known problem with Maven. Has any one else seen this?
>> >
>> > The build completes with a "BUILD SUCCESS" but the JIRA Report page is
>> > blank. I'll have to try with an older version of Maven later...
>> >
>> > Using:
>> >
>> > Apache Maven 3.3.1 (cab6659f9874fa96462afef40fcf6bc033d58c1c;
>> > 2015-03-13T13:10:27-07:00)
>> > Maven home: C:\Java\apache-maven-3.3.1
>> > Java version: 1.7.0_75, vendor: Oracle Corporation
>> > Java home: C:\Program Files\Java\jdk1.7.0_75\jre
>> > Default locale: en_US, platform encoding: Cp1252
>> > OS name: "windows 7", version: "6.1", arch: "amd64", family: "windows"
>> >
>> > Gary
>> >
>> > On Mon, Apr 13, 2015 at 5:28 AM, luc <[hidden email]> wrote:
>> >
>> >> +1 from myself.
>> >>
>> >> Luc
>> >>
>> >>
>> >> Le 2015-04-13 00:02, Bruno P. Kinoshita a écrit :
>> >>
>> >>> +1 non binding.
>> >>>
>> >>> Build works fine in the following environment
>> >>> Apache Maven 3.2.5 (12a6b3acb947671f09b81f49094c53f426d8cea1;
>> >>> 2014-12-15T06:29:23+13:00)
>> >>> Maven home: /opt/apache-maven-3.2.5
>> >>> Java version: 1.8.0_40, vendor: Oracle Corporation
>> >>> Java home: /usr/lib/jvm/java-8-oracle/jre
>> >>> Default locale: en_US, platform encoding: UTF-8
>> >>> OS name: "linux", version: "3.16.0-34-generic", arch: "amd64", family:
>> >>> "unix"
>> >>>
>> >>> Site generated corrected with the right version. All tests pass, 37
>> >>> skipped. No new checkstyle errors, no new PMD errors (one was fixed I
>> >>> think), and no new findbugs errors as well.
>> >>> CheersBruno
>> >>>
>> >>>
>> >>>       From: Luc Maisonobe <[hidden email]>
>> >>>  To: Commons Developers List <[hidden email]>
>> >>>  Sent: Monday, April 13, 2015 6:38 AM
>> >>>  Subject: [VOTE][RC1] Release Apache Commons Math 3.5
>> >>>
>> >>> This is a [VOTE] for releasing Apache Commons Math 3.5 from release
>> >>> candidate 1.
>> >>>
>> >>> Tag name: MATH_3_5_RC1 (signature can be checked from git using 'git
>> tag
>> >>> -v')
>> >>>
>> >>> Tag URL:
>> >>>
>> >>> <
>> https://git-wip-us.apache.org/repos/asf?p=commons-math.git;a=commit;h=
>> >>> 7efda3f0a0941362e9e4152d0e0e92872a8ce8d3>
>> >>>
>> >>> Commit ID the tag points at: 7efda3f0a0941362e9e4152d0e0e92872a8ce8d3
>> >>>
>> >>> Site: <http://people.apache.org/~luc/commons-math-3.5-RC1-site>
>> >>>
>> >>> Distribution files:
>> https://dist.apache.org/repos/dist/dev/commons/math/
>> >>>
>> >>> Distribution files hashes (SHA1):
>> >>> 3a06c6297f4975b6a5f32bacdfad126c8cec94b7 commons-math3-3.5-bin.tar.gz
>> >>> 2873864620239f4a3efd3d088f06fbd2d533b224 commons-math3-3.5-bin.zip
>> >>> 7ff72a98ea2da18dda7846adc699a18893b8c26b commons-math3-3.5-src.tar.gz
>> >>> 2838050ebe95fb5456e1eca15af1e005b08011fa commons-math3-3.5-src.zip
>> >>>
>> >>> The svn commit revision for the distribution files above is r8586.
>> >>>
>> >>> KEYS file to check signatures:
>> http://www.apache.org/dist/commons/KEYS
>> >>>
>> >>> Maven artifacts:
>> >>>
>> >>> <https://repository.apache.org/content/repositories/
>> >>> orgapachecommons-1087/org/apache/commons/commons-math3/3.5/>
>> >>>
>> >>> [ ] +1 Release it.
>> >>> [ ] +0 Go ahead; I don't care.
>> >>> [ ] -0 There are a few minor glitches: ...
>> >>> [ ] -1 No, do not release it because ...
>> >>>
>> >>> This vote will close in 72 hours, at 2015-04-15T19:00:00Z (this is UTC
>> >>> time).
>> >>>
>> >>>
>> >>> ---------------------------------------------------------------------
>> >>> To unsubscribe, e-mail: [hidden email]
>> >>> For additional commands, e-mail: [hidden email]
>> >>>
>> >>
>> >> ---------------------------------------------------------------------
>> >> To unsubscribe, e-mail: [hidden email]
>> >> For additional commands, e-mail: [hidden email]
>> >>
>> >>
>> >
>> >
>>
>>
>> ---------------------------------------------------------------------
>> To unsubscribe, e-mail: [hidden email]
>> For additional commands, e-mail: [hidden email]
>>
>>
>
>
> --
> E-Mail: [hidden email] | [hidden email]
> Java Persistence with Hibernate, Second Edition
> <http://www.manning.com/bauer3/>
> JUnit in Action, Second Edition <http://www.manning.com/tahchiev/>
> Spring Batch in Action <http://www.manning.com/templier/>
> Blog: http://garygregory.wordpress.com
> Home: http://garygregory.com/
> Tweet! http://twitter.com/GaryGregory
>



--
E-Mail: [hidden email] | [hidden email]
Java Persistence with Hibernate, Second Edition
<http://www.manning.com/bauer3/>
JUnit in Action, Second Edition <http://www.manning.com/tahchiev/>
Spring Batch in Action <http://www.manning.com/templier/>
Blog: http://garygregory.wordpress.com
Home: http://garygregory.com/
Tweet! http://twitter.com/GaryGregory
Reply | Threaded
Open this post in threaded view
|

Re: [VOTE][RC1] Release Apache Commons Math 3.5

Luc Maisonobe-2
In reply to this post by Benedikt Ritter-4
Le 13/04/2015 20:29, Benedikt Ritter a écrit :

> Hi,
>
> tested with:
>
> Apache Maven 3.3.1 (cab6659f9874fa96462afef40fcf6bc033d58c1c;
> 2015-03-13T21:10:27+01:00)
> Maven home: /usr/local/Cellar/maven/3.3.1/libexec
> Java version: 1.8.0_31, vendor: Oracle Corporation
> Java home:
> /Library/Java/JavaVirtualMachines/jdk1.8.0_31.jdk/Contents/Home/jre
> Default locale: de_DE, platform encoding: UTF-8
> OS name: "mac os x", version: "10.10.2", arch: "x86_64", family: "mac"
>
> And Java 7 and 8.
>
> - Build works
> - Signs and hashes are good
> - Site looks good
> - PMD errors sound like they are easy to fix, but I don't know the math
> code...
> - No CPD report?

No, we've dropped it a while ago, and won't activate it again before
4.0. Due to several refactoring plus compatibility that forced us to
keep older versions, there are a bunch of copies (typically 3 different
versions of some optimizers with identical code but different APIs). So
CPD complained (it was right), but this was simply too much and was
really a design decision.

best regards,
Luc

>
> +1
>
> Benedikt
>
>
> 2015-04-12 20:38 GMT+02:00 Luc Maisonobe <[hidden email]>:
>
>> This is a [VOTE] for releasing Apache Commons Math 3.5 from release
>> candidate 1.
>>
>> Tag name: MATH_3_5_RC1 (signature can be checked from git using 'git tag
>> -v')
>>
>> Tag URL:
>>
>> <
>> https://git-wip-us.apache.org/repos/asf?p=commons-math.git;a=commit;h=7efda3f0a0941362e9e4152d0e0e92872a8ce8d3
>>>
>>
>> Commit ID the tag points at: 7efda3f0a0941362e9e4152d0e0e92872a8ce8d3
>>
>> Site: <http://people.apache.org/~luc/commons-math-3.5-RC1-site>
>>
>> Distribution files: https://dist.apache.org/repos/dist/dev/commons/math/
>>
>> Distribution files hashes (SHA1):
>> 3a06c6297f4975b6a5f32bacdfad126c8cec94b7 commons-math3-3.5-bin.tar.gz
>> 2873864620239f4a3efd3d088f06fbd2d533b224 commons-math3-3.5-bin.zip
>> 7ff72a98ea2da18dda7846adc699a18893b8c26b commons-math3-3.5-src.tar.gz
>> 2838050ebe95fb5456e1eca15af1e005b08011fa commons-math3-3.5-src.zip
>>
>> The svn commit revision for the distribution files above is r8586.
>>
>> KEYS file to check signatures: http://www.apache.org/dist/commons/KEYS
>>
>> Maven artifacts:
>>
>> <
>> https://repository.apache.org/content/repositories/orgapachecommons-1087/org/apache/commons/commons-math3/3.5/
>>>
>>
>> [ ] +1 Release it.
>> [ ] +0 Go ahead; I don't care.
>> [ ] -0 There are a few minor glitches: ...
>> [ ] -1 No, do not release it because ...
>>
>> This vote will close in 72 hours, at 2015-04-15T19:00:00Z (this is UTC
>> time).
>>
>>
>> ---------------------------------------------------------------------
>> To unsubscribe, e-mail: [hidden email]
>> For additional commands, e-mail: [hidden email]
>>
>>
>
>


---------------------------------------------------------------------
To unsubscribe, e-mail: [hidden email]
For additional commands, e-mail: [hidden email]

Reply | Threaded
Open this post in threaded view
|

Re: [VOTE][RC1] Release Apache Commons Math 3.5

Luc Maisonobe-2
In reply to this post by garydgregory
Le 13/04/2015 22:08, Gary Gregory a écrit :
> +1.
>
> Tested with src zip; MD5, ASC OK. Site builds (including JIRA report, which
> fails with Maven 3.3.1.). Reports looks good. Can't attest if PMD and
> Checkstyle are better or worse than previous release though.

We generally aim at 0 chectyle and findbugs warnings, and PMD warnings
are mostly false positive.

best regards,
Luc

>
> Tested with:
>
> Apache Maven 3.2.5 (12a6b3acb947671f09b81f49094c53f426d8cea1;
> 2014-12-14T09:29:23-08:00)
> Maven home: C:\Java\apache-maven-3.2.5
> Java version: 1.7.0_75, vendor: Oracle Corporation
> Java home: C:\Program Files\Java\jdk1.7.0_75\jre
> Default locale: en_US, platform encoding: Cp1252
> OS name: "windows 7", version: "6.1", arch: "amd64", family: "windows"
>
> The tests print noise on the console, not a blocker of course:
>
>>> testExpInf4()
> inf=-Infinity
> intval=2147483647
> neginf<0=true
> expReal=0.0
> cosImag=0.5403023058681398
> sinImag=0.8414709848078965
> result=(0.0, 0.0)
> <<testExpInf4()
>>> testJava()
> Math.exp=0.0
> java.version=1.7.0_75
> java.vendor=Oracle Corporation
> java.vm.specification.version=1.7
> java.vm.specification.vendor=Oracle Corporation
> java.vm.specification.name=Java Virtual Machine Specification
> java.vm.version=24.75-b04
> java.vm.vendor=Oracle Corporation
> java.vm.name=Java HotSpot(TM) 64-Bit Server VM
> java.specification.version=1.7
> java.specification.vendor=Oracle Corporation
> java.specification.name=Java Platform API Specification
> java.class.version=51.0
> <<testJava()
>
> Gary
>
> On Mon, Apr 13, 2015 at 10:55 AM, Gary Gregory <[hidden email]>
> wrote:
>
>>
>> On Mon, Apr 13, 2015 at 10:51 AM, Luc Maisonobe <[hidden email]>
>> wrote:
>>
>>> Le 13/04/2015 18:15, Gary Gregory a écrit :
>>>> When I build from the src zip, I get a bunch of:
>>>>
>>>> [ERROR]
>>>> java.lang.IllegalArgumentException: One of setGitDir or setWorkTree
>>> must be
>>>> called.
>>>
>>> Yes, it is caused by the buildnumber plugin that cannot find the git
>>> commit since you are not in a git tree.
>>>
>>> It does not prevent the build from working and provides consistent
>>> results, but I agree it is weird.
>>>
>>> So do you +1 or not ?
>>>
>>
>> I am busy ATM, sorry, I'll rerun later.
>> Gary
>>
>>>
>>> Luc
>>>
>>>>         at
>>>>
>>> org.eclipse.jgit.lib.BaseRepositoryBuilder.requireGitDirOrWorkTree(BaseRepositoryBuilder.java:582)
>>>>         at
>>>>
>>> org.eclipse.jgit.lib.BaseRepositoryBuilder.setup(BaseRepositoryBuilder.java:550)
>>>>         at
>>>>
>>> org.eclipse.jgit.storage.file.FileRepositoryBuilder.build(FileRepositoryBuilder.java:89)
>>>>         at
>>>>
>>> ru.concerteza.util.buildnumber.BuildNumberExtractor.extract(BuildNumberExtractor.java:38)
>>>>         at
>>>>
>>> ru.concerteza.util.buildnumber.JGitBuildNumberMojo.execute(JGitBuildNumberMojo.java:124)
>>>>         at
>>>>
>>> org.apache.maven.plugin.DefaultBuildPluginManager.executeMojo(DefaultBuildPluginManager.java:134)
>>>>         at
>>>>
>>> org.apache.maven.lifecycle.internal.MojoExecutor.execute(MojoExecutor.java:208)
>>>>         at
>>>>
>>> org.apache.maven.lifecycle.internal.MojoExecutor.execute(MojoExecutor.java:153)
>>>>         at
>>>>
>>> org.apache.maven.lifecycle.internal.MojoExecutor.execute(MojoExecutor.java:145)
>>>>         at
>>>>
>>> org.apache.maven.lifecycle.internal.MojoExecutor.executeForkedExecutions(MojoExecutor.java:364)
>>>>         at
>>>>
>>> org.apache.maven.lifecycle.DefaultLifecycleExecutor.executeForkedExecutions(DefaultLifecycleExecutor.java:173)
>>>>         at
>>>>
>>> org.apache.maven.reporting.exec.DefaultMavenReportExecutor.buildReportPlugin(DefaultMavenReportExecutor.java:273)
>>>>         at
>>>>
>>> org.apache.maven.reporting.exec.DefaultMavenReportExecutor.buildMavenReports(DefaultMavenReportExecutor.java:154)
>>>>         at
>>>>
>>> org.apache.maven.plugins.site.AbstractSiteRenderingMojo.getReports(AbstractSiteRenderingMojo.java:235)
>>>>         at
>>> org.apache.maven.plugins.site.SiteMojo.execute(SiteMojo.java:121)
>>>>         at
>>>>
>>> org.apache.maven.plugin.DefaultBuildPluginManager.executeMojo(DefaultBuildPluginManager.java:134)
>>>>         at
>>>>
>>> org.apache.maven.lifecycle.internal.MojoExecutor.execute(MojoExecutor.java:208)
>>>>         at
>>>>
>>> org.apache.maven.lifecycle.internal.MojoExecutor.execute(MojoExecutor.java:153)
>>>>         at
>>>>
>>> org.apache.maven.lifecycle.internal.MojoExecutor.execute(MojoExecutor.java:145)
>>>>         at
>>>>
>>> org.apache.maven.lifecycle.internal.LifecycleModuleBuilder.buildProject(LifecycleModuleBuilder.java:116)
>>>>         at
>>>>
>>> org.apache.maven.lifecycle.internal.LifecycleModuleBuilder.buildProject(LifecycleModuleBuilder.java:80)
>>>>         at
>>>>
>>> org.apache.maven.lifecycle.internal.builder.singlethreaded.SingleThreadedBuilder.build(SingleThreadedBuilder.java:51)
>>>>         at
>>>>
>>> org.apache.maven.lifecycle.internal.LifecycleStarter.execute(LifecycleStarter.java:128)
>>>>         at
>>> org.apache.maven.DefaultMaven.doExecute(DefaultMaven.java:307)
>>>>         at
>>> org.apache.maven.DefaultMaven.doExecute(DefaultMaven.java:193)
>>>>         at org.apache.maven.DefaultMaven.execute(DefaultMaven.java:106)
>>>>         at org.apache.maven.cli.MavenCli.execute(MavenCli.java:862)
>>>>         at org.apache.maven.cli.MavenCli.doMain(MavenCli.java:286)
>>>>         at org.apache.maven.cli.MavenCli.main(MavenCli.java:197)
>>>>         at sun.reflect.NativeMethodAccessorImpl.invoke0(Native Method)
>>>>         at
>>>>
>>> sun.reflect.NativeMethodAccessorImpl.invoke(NativeMethodAccessorImpl.java:57)
>>>>         at
>>>>
>>> sun.reflect.DelegatingMethodAccessorImpl.invoke(DelegatingMethodAccessorImpl.java:43)
>>>>         at java.lang.reflect.Method.invoke(Method.java:606)
>>>>         at
>>>>
>>> org.codehaus.plexus.classworlds.launcher.Launcher.launchEnhanced(Launcher.java:289)
>>>>         at
>>>>
>>> org.codehaus.plexus.classworlds.launcher.Launcher.launch(Launcher.java:229)
>>>>         at
>>>>
>>> org.codehaus.plexus.classworlds.launcher.Launcher.mainWithExitCode(Launcher.java:415)
>>>>         at
>>>>
>>> org.codehaus.plexus.classworlds.launcher.Launcher.main(Launcher.java:356)
>>>>
>>>> and one:
>>>>
>>>> [WARN] An issue has occurred with report
>>>> org.apache.maven.plugin.jira.JiraMojo, skip LinkageError
>>>>
>>> org.slf4j.spi.LocationAwareLogger.log(Lorg/slf4j/Marker;Ljava/lang/String;ILjava/lang/String;Ljava/lang/Throwable;)V,
>>>> please report an issue to Maven dev team.
>>>> java.lang.NoSuchMethodError:
>>>>
>>> org.slf4j.spi.LocationAwareLogger.log(Lorg/slf4j/Marker;Ljava/lang/String;ILjava/lang/String;Ljava/lang/Throwable;)V
>>>>         at
>>>>
>>> org.apache.commons.logging.impl.SLF4JLocationAwareLog.trace(SLF4JLocationAwareLog.java:99)
>>>>         at
>>>>
>>> org.apache.commons.httpclient.methods.GetMethod.<init>(GetMethod.java:89)
>>>>         at
>>>>
>>> org.apache.maven.plugin.jira.ClassicJiraDownloader.download(ClassicJiraDownloader.java:364)
>>>>         at
>>>>
>>> org.apache.maven.plugin.jira.ClassicJiraDownloader.doExecute(ClassicJiraDownloader.java:123)
>>>>         at
>>>>
>>> org.apache.maven.plugin.jira.AdaptiveJiraDownloader.doExecute(AdaptiveJiraDownloader.java:54)
>>>>         at
>>>> org.apache.maven.plugin.jira.JiraMojo.executeReport(JiraMojo.java:367)
>>>>         at
>>>>
>>> org.apache.maven.reporting.AbstractMavenReport.generate(AbstractMavenReport.java:190)
>>>>         at
>>>>
>>> org.apache.maven.plugins.site.ReportDocumentRenderer.renderDocument(ReportDocumentRenderer.java:219)
>>>>         at
>>>>
>>> org.apache.maven.doxia.siterenderer.DefaultSiteRenderer.renderModule(DefaultSiteRenderer.java:319)
>>>>         at
>>>>
>>> org.apache.maven.doxia.siterenderer.DefaultSiteRenderer.render(DefaultSiteRenderer.java:135)
>>>>         at
>>>> org.apache.maven.plugins.site.SiteMojo.renderLocale(SiteMojo.java:175)
>>>>         at
>>> org.apache.maven.plugins.site.SiteMojo.execute(SiteMojo.java:138)
>>>>         at
>>>>
>>> org.apache.maven.plugin.DefaultBuildPluginManager.executeMojo(DefaultBuildPluginManager.java:134)
>>>>         at
>>>>
>>> org.apache.maven.lifecycle.internal.MojoExecutor.execute(MojoExecutor.java:208)
>>>>         at
>>>>
>>> org.apache.maven.lifecycle.internal.MojoExecutor.execute(MojoExecutor.java:153)
>>>>         at
>>>>
>>> org.apache.maven.lifecycle.internal.MojoExecutor.execute(MojoExecutor.java:145)
>>>>         at
>>>>
>>> org.apache.maven.lifecycle.internal.LifecycleModuleBuilder.buildProject(LifecycleModuleBuilder.java:116)
>>>>         at
>>>>
>>> org.apache.maven.lifecycle.internal.LifecycleModuleBuilder.buildProject(LifecycleModuleBuilder.java:80)
>>>>         at
>>>>
>>> org.apache.maven.lifecycle.internal.builder.singlethreaded.SingleThreadedBuilder.build(SingleThreadedBuilder.java:51)
>>>>         at
>>>>
>>> org.apache.maven.lifecycle.internal.LifecycleStarter.execute(LifecycleStarter.java:128)
>>>>         at
>>> org.apache.maven.DefaultMaven.doExecute(DefaultMaven.java:307)
>>>>         at
>>> org.apache.maven.DefaultMaven.doExecute(DefaultMaven.java:193)
>>>>         at org.apache.maven.DefaultMaven.execute(DefaultMaven.java:106)
>>>>         at org.apache.maven.cli.MavenCli.execute(MavenCli.java:862)
>>>>         at org.apache.maven.cli.MavenCli.doMain(MavenCli.java:286)
>>>>         at org.apache.maven.cli.MavenCli.main(MavenCli.java:197)
>>>>         at sun.reflect.NativeMethodAccessorImpl.invoke0(Native Method)
>>>>         at
>>>>
>>> sun.reflect.NativeMethodAccessorImpl.invoke(NativeMethodAccessorImpl.java:57)
>>>>         at
>>>>
>>> sun.reflect.DelegatingMethodAccessorImpl.invoke(DelegatingMethodAccessorImpl.java:43)
>>>>         at java.lang.reflect.Method.invoke(Method.java:606)
>>>>         at
>>>>
>>> org.codehaus.plexus.classworlds.launcher.Launcher.launchEnhanced(Launcher.java:289)
>>>>         at
>>>>
>>> org.codehaus.plexus.classworlds.launcher.Launcher.launch(Launcher.java:229)
>>>>         at
>>>>
>>> org.codehaus.plexus.classworlds.launcher.Launcher.mainWithExitCode(Launcher.java:415)
>>>>         at
>>>>
>>> org.codehaus.plexus.classworlds.launcher.Launcher.main(Launcher.java:356)
>>>>
>>>> Which IIRC is a known problem with Maven. Has any one else seen this?
>>>>
>>>> The build completes with a "BUILD SUCCESS" but the JIRA Report page is
>>>> blank. I'll have to try with an older version of Maven later...
>>>>
>>>> Using:
>>>>
>>>> Apache Maven 3.3.1 (cab6659f9874fa96462afef40fcf6bc033d58c1c;
>>>> 2015-03-13T13:10:27-07:00)
>>>> Maven home: C:\Java\apache-maven-3.3.1
>>>> Java version: 1.7.0_75, vendor: Oracle Corporation
>>>> Java home: C:\Program Files\Java\jdk1.7.0_75\jre
>>>> Default locale: en_US, platform encoding: Cp1252
>>>> OS name: "windows 7", version: "6.1", arch: "amd64", family: "windows"
>>>>
>>>> Gary
>>>>
>>>> On Mon, Apr 13, 2015 at 5:28 AM, luc <[hidden email]> wrote:
>>>>
>>>>> +1 from myself.
>>>>>
>>>>> Luc
>>>>>
>>>>>
>>>>> Le 2015-04-13 00:02, Bruno P. Kinoshita a écrit :
>>>>>
>>>>>> +1 non binding.
>>>>>>
>>>>>> Build works fine in the following environment
>>>>>> Apache Maven 3.2.5 (12a6b3acb947671f09b81f49094c53f426d8cea1;
>>>>>> 2014-12-15T06:29:23+13:00)
>>>>>> Maven home: /opt/apache-maven-3.2.5
>>>>>> Java version: 1.8.0_40, vendor: Oracle Corporation
>>>>>> Java home: /usr/lib/jvm/java-8-oracle/jre
>>>>>> Default locale: en_US, platform encoding: UTF-8
>>>>>> OS name: "linux", version: "3.16.0-34-generic", arch: "amd64", family:
>>>>>> "unix"
>>>>>>
>>>>>> Site generated corrected with the right version. All tests pass, 37
>>>>>> skipped. No new checkstyle errors, no new PMD errors (one was fixed I
>>>>>> think), and no new findbugs errors as well.
>>>>>> CheersBruno
>>>>>>
>>>>>>
>>>>>>       From: Luc Maisonobe <[hidden email]>
>>>>>>  To: Commons Developers List <[hidden email]>
>>>>>>  Sent: Monday, April 13, 2015 6:38 AM
>>>>>>  Subject: [VOTE][RC1] Release Apache Commons Math 3.5
>>>>>>
>>>>>> This is a [VOTE] for releasing Apache Commons Math 3.5 from release
>>>>>> candidate 1.
>>>>>>
>>>>>> Tag name: MATH_3_5_RC1 (signature can be checked from git using 'git
>>> tag
>>>>>> -v')
>>>>>>
>>>>>> Tag URL:
>>>>>>
>>>>>> <
>>> https://git-wip-us.apache.org/repos/asf?p=commons-math.git;a=commit;h=
>>>>>> 7efda3f0a0941362e9e4152d0e0e92872a8ce8d3>
>>>>>>
>>>>>> Commit ID the tag points at: 7efda3f0a0941362e9e4152d0e0e92872a8ce8d3
>>>>>>
>>>>>> Site: <http://people.apache.org/~luc/commons-math-3.5-RC1-site>
>>>>>>
>>>>>> Distribution files:
>>> https://dist.apache.org/repos/dist/dev/commons/math/
>>>>>>
>>>>>> Distribution files hashes (SHA1):
>>>>>> 3a06c6297f4975b6a5f32bacdfad126c8cec94b7 commons-math3-3.5-bin.tar.gz
>>>>>> 2873864620239f4a3efd3d088f06fbd2d533b224 commons-math3-3.5-bin.zip
>>>>>> 7ff72a98ea2da18dda7846adc699a18893b8c26b commons-math3-3.5-src.tar.gz
>>>>>> 2838050ebe95fb5456e1eca15af1e005b08011fa commons-math3-3.5-src.zip
>>>>>>
>>>>>> The svn commit revision for the distribution files above is r8586.
>>>>>>
>>>>>> KEYS file to check signatures:
>>> http://www.apache.org/dist/commons/KEYS
>>>>>>
>>>>>> Maven artifacts:
>>>>>>
>>>>>> <https://repository.apache.org/content/repositories/
>>>>>> orgapachecommons-1087/org/apache/commons/commons-math3/3.5/>
>>>>>>
>>>>>> [ ] +1 Release it.
>>>>>> [ ] +0 Go ahead; I don't care.
>>>>>> [ ] -0 There are a few minor glitches: ...
>>>>>> [ ] -1 No, do not release it because ...
>>>>>>
>>>>>> This vote will close in 72 hours, at 2015-04-15T19:00:00Z (this is UTC
>>>>>> time).
>>>>>>
>>>>>>
>>>>>> ---------------------------------------------------------------------
>>>>>> To unsubscribe, e-mail: [hidden email]
>>>>>> For additional commands, e-mail: [hidden email]
>>>>>>
>>>>>
>>>>> ---------------------------------------------------------------------
>>>>> To unsubscribe, e-mail: [hidden email]
>>>>> For additional commands, e-mail: [hidden email]
>>>>>
>>>>>
>>>>
>>>>
>>>
>>>
>>> ---------------------------------------------------------------------
>>> To unsubscribe, e-mail: [hidden email]
>>> For additional commands, e-mail: [hidden email]
>>>
>>>
>>
>>
>> --
>> E-Mail: [hidden email] | [hidden email]
>> Java Persistence with Hibernate, Second Edition
>> <http://www.manning.com/bauer3/>
>> JUnit in Action, Second Edition <http://www.manning.com/tahchiev/>
>> Spring Batch in Action <http://www.manning.com/templier/>
>> Blog: http://garygregory.wordpress.com
>> Home: http://garygregory.com/
>> Tweet! http://twitter.com/GaryGregory
>>
>
>
>


---------------------------------------------------------------------
To unsubscribe, e-mail: [hidden email]
For additional commands, e-mail: [hidden email]

Reply | Threaded
Open this post in threaded view
|

Re: [VOTE][RC1] Release Apache Commons Math 3.5

Jörg Schaible
In reply to this post by Luc Maisonobe-2
Hi Luc,

-1, it claims to be Java 5 compatible, but it is not (at least not the
tests):

============================== %< ========================
$ mvn -P java-1.5 clean test
[INFO] Scanning for projects...
[INFO]                                                                        
[INFO]
------------------------------------------------------------------------
[INFO] Building Apache Commons Math 3.5
[INFO]
------------------------------------------------------------------------
[INFO]
[INFO] --- maven-clean-plugin:2.5:clean (default-clean) @ commons-math3 ---
[INFO] Deleting /home/joehni/tmp/download/commons-math3-3.5-src/target
[INFO]
[INFO] --- maven-enforcer-plugin:1.3.1:enforce (enforce-maven-3) @ commons-
math3 ---
[INFO]
[INFO] --- maven-antrun-plugin:1.7:run (javadoc.resources) @ commons-math3
---
[INFO] Executing tasks

main:
     [copy] Copying 2 files to /home/joehni/tmp/download/commons-math3-3.5-
src/target/apidocs/META-INF
[INFO] Executed tasks
[INFO]
[INFO] --- maven-remote-resources-plugin:1.5:process (default) @ commons-
math3 ---
[INFO]
[INFO] --- buildnumber-maven-plugin:1.2:create (default) @ commons-math3 ---
[INFO] Checking for local modifications: skipped.
[INFO] Updating project files from SCM: skipped.
[INFO] Executing: /bin/sh -c cd /home/joehni/tmp/download/commons-math3-3.5-
src && git rev-parse --verify HEAD
[INFO] Working directory: /home/joehni/tmp/download/commons-math3-3.5-src
[INFO] Storing buildNumber: ?????? at timestamp: 1428960511127
[INFO] Executing: /bin/sh -c cd /home/joehni/tmp/download/commons-math3-3.5-
src && git rev-parse --verify HEAD
[INFO] Working directory: /home/joehni/tmp/download/commons-math3-3.5-src
[INFO] Storing buildScmBranch: UNKNOWN_BRANCH
[INFO]
[INFO] --- maven-jgit-buildnumber-plugin:1.2.8:extract-buildnumber (default)
@ commons-math3 ---
[ERROR]
java.lang.IllegalArgumentException: One of setGitDir or setWorkTree must be
called.
        at
org.eclipse.jgit.lib.BaseRepositoryBuilder.requireGitDirOrWorkTree(BaseRepositoryBuilder.java:582)
        at
org.eclipse.jgit.lib.BaseRepositoryBuilder.setup(BaseRepositoryBuilder.java:550)
        at
org.eclipse.jgit.storage.file.FileRepositoryBuilder.build(FileRepositoryBuilder.java:89)
        at
ru.concerteza.util.buildnumber.BuildNumberExtractor.extract(BuildNumberExtractor.java:38)
        at
ru.concerteza.util.buildnumber.JGitBuildNumberMojo.execute(JGitBuildNumberMojo.java:124)
        at
org.apache.maven.plugin.DefaultBuildPluginManager.executeMojo(DefaultBuildPluginManager.java:132)
        at
org.apache.maven.lifecycle.internal.MojoExecutor.execute(MojoExecutor.java:208)
        at
org.apache.maven.lifecycle.internal.MojoExecutor.execute(MojoExecutor.java:153)
        at
org.apache.maven.lifecycle.internal.MojoExecutor.execute(MojoExecutor.java:145)
        at
org.apache.maven.lifecycle.internal.LifecycleModuleBuilder.buildProject(LifecycleModuleBuilder.java:116)
        at
org.apache.maven.lifecycle.internal.LifecycleModuleBuilder.buildProject(LifecycleModuleBuilder.java:80)
        at
org.apache.maven.lifecycle.internal.builder.singlethreaded.SingleThreadedBuilder.build(SingleThreadedBuilder.java:51)
        at
org.apache.maven.lifecycle.internal.LifecycleStarter.execute(LifecycleStarter.java:120)
        at org.apache.maven.DefaultMaven.doExecute(DefaultMaven.java:355)
        at org.apache.maven.DefaultMaven.execute(DefaultMaven.java:155)
        at org.apache.maven.cli.MavenCli.execute(MavenCli.java:584)
        at org.apache.maven.cli.MavenCli.doMain(MavenCli.java:216)
        at org.apache.maven.cli.MavenCli.main(MavenCli.java:160)
        at sun.reflect.NativeMethodAccessorImpl.invoke0(Native Method)
        at
sun.reflect.NativeMethodAccessorImpl.invoke(NativeMethodAccessorImpl.java:57)
        at
sun.reflect.DelegatingMethodAccessorImpl.invoke(DelegatingMethodAccessorImpl.java:43)
        at java.lang.reflect.Method.invoke(Method.java:606)
        at
org.codehaus.plexus.classworlds.launcher.Launcher.launchEnhanced(Launcher.java:289)
        at
org.codehaus.plexus.classworlds.launcher.Launcher.launch(Launcher.java:229)
        at
org.codehaus.plexus.classworlds.launcher.Launcher.mainWithExitCode(Launcher.java:415)
        at
org.codehaus.plexus.classworlds.launcher.Launcher.main(Launcher.java:356)
[INFO]
[INFO] --- maven-resources-plugin:2.6:resources (default-resources) @
commons-math3 ---
[INFO] Using 'UTF-8' encoding to copy filtered resources.
[INFO] Copying 2 resources
[INFO] Copying 2 resources to META-INF
[INFO]
[INFO] --- maven-compiler-plugin:3.1:compile (default-compile) @ commons-
math3 ---
[INFO] Changes detected - recompiling the module!
[INFO] Compiling 927 source files to /home/joehni/tmp/download/commons-
math3-3.5-src/target/classes
[INFO]
[INFO] --- maven-bundle-plugin:2.4.0:manifest (bundle-manifest) @ commons-
math3 ---
[INFO]
[INFO] --- maven-resources-plugin:2.6:testResources (default-testResources)
@ commons-math3 ---
[INFO] Using 'UTF-8' encoding to copy filtered resources.
[INFO] Copying 38 resources
[INFO] Copying 2 resources to META-INF
[INFO]
[INFO] --- maven-compiler-plugin:3.1:testCompile (default-testCompile) @
commons-math3 ---
[INFO] Changes detected - recompiling the module!
[INFO] Compiling 570 source files to /home/joehni/tmp/download/commons-
math3-3.5-src/target/test-classes
[INFO] -------------------------------------------------------------
[ERROR] COMPILATION ERROR :
[INFO] -------------------------------------------------------------
[ERROR] /home/joehni/tmp/download/commons-math3-3.5-
src/src/test/java/org/apache/commons/math3/geometry/partitioning/RegionDumper.java:
[207,9] method does not override a method from its superclass
[ERROR] /home/joehni/tmp/download/commons-math3-3.5-
src/src/test/java/org/apache/commons/math3/geometry/partitioning/RegionDumper.java:
[213,9] method does not override a method from its superclass
[ERROR] /home/joehni/tmp/download/commons-math3-3.5-
src/src/test/java/org/apache/commons/math3/geometry/partitioning/RegionDumper.java:
[222,9] method does not override a method from its superclass
[ERROR] /home/joehni/tmp/download/commons-math3-3.5-
src/src/test/java/org/apache/commons/math3/geometry/euclidean/threed/PolyhedronsSetTest.java:
[397,8] cannot find symbol
symbol  : method
checkError(java.util.List<org.apache.commons.math3.geometry.euclidean.threed.Vector3D>,java.util.List<<nulltype>[]>,org.apache.commons.math3.exception.util.LocalizedFormats)
location: class
org.apache.commons.math3.geometry.euclidean.threed.PolyhedronsSetTest
[INFO] 4 errors
[INFO] -------------------------------------------------------------
[INFO]
------------------------------------------------------------------------
[INFO] BUILD FAILURE
[INFO]
------------------------------------------------------------------------
[INFO] Total time: 17.806 s
[INFO] Finished at: 2015-04-13T23:28:46+02:00
[INFO] Final Memory: 18M/220M
[INFO]
------------------------------------------------------------------------
[ERROR] Failed to execute goal org.apache.maven.plugins:maven-compiler-
plugin:3.1:testCompile (default-testCompile) on project commons-math3:
Compilation failure: Compilation failure:
[ERROR] /home/joehni/tmp/download/commons-math3-3.5-
src/src/test/java/org/apache/commons/math3/geometry/partitioning/RegionDumper.java:
[207,9] method does not override a method from its superclass
[ERROR] /home/joehni/tmp/download/commons-math3-3.5-
src/src/test/java/org/apache/commons/math3/geometry/partitioning/RegionDumper.java:
[213,9] method does not override a method from its superclass
[ERROR] /home/joehni/tmp/download/commons-math3-3.5-
src/src/test/java/org/apache/commons/math3/geometry/partitioning/RegionDumper.java:
[222,9] method does not override a method from its superclass
[ERROR] /home/joehni/tmp/download/commons-math3-3.5-
src/src/test/java/org/apache/commons/math3/geometry/euclidean/threed/PolyhedronsSetTest.java:
[397,8] cannot find symbol
[ERROR] symbol  : method
checkError(java.util.List<org.apache.commons.math3.geometry.euclidean.threed.Vector3D>,java.util.List<<nulltype>[]>,org.apache.commons.math3.exception.util.LocalizedFormats)
[ERROR] location: class
org.apache.commons.math3.geometry.euclidean.threed.PolyhedronsSetTest
[ERROR] -> [Help 1]
[ERROR]
[ERROR] To see the full stack trace of the errors, re-run Maven with the -e
switch.
[ERROR] Re-run Maven using the -X switch to enable full debug logging.
[ERROR]
[ERROR] For more information about the errors and possible solutions, please
read the following articles:
[ERROR] [Help 1]
http://cwiki.apache.org/confluence/display/MAVEN/MojoFailureException
============================== %< ========================

Cheers,
Jörg

Luc Maisonobe wrote:

> This is a [VOTE] for releasing Apache Commons Math 3.5 from release
> candidate 1.
>
> Tag name: MATH_3_5_RC1 (signature can be checked from git using 'git tag
> -v')
>
> Tag URL:
>
> <https://git-wip-us.apache.org/repos/asf?p=commons-math.git;a=commit;h=7efda3f0a0941362e9e4152d0e0e92872a8ce8d3>
>
> Commit ID the tag points at: 7efda3f0a0941362e9e4152d0e0e92872a8ce8d3
>
> Site: <http://people.apache.org/~luc/commons-math-3.5-RC1-site>
>
> Distribution files: https://dist.apache.org/repos/dist/dev/commons/math/
>
> Distribution files hashes (SHA1):
> 3a06c6297f4975b6a5f32bacdfad126c8cec94b7 commons-math3-3.5-bin.tar.gz
> 2873864620239f4a3efd3d088f06fbd2d533b224 commons-math3-3.5-bin.zip
> 7ff72a98ea2da18dda7846adc699a18893b8c26b commons-math3-3.5-src.tar.gz
> 2838050ebe95fb5456e1eca15af1e005b08011fa commons-math3-3.5-src.zip
>
> The svn commit revision for the distribution files above is r8586.
>
> KEYS file to check signatures: http://www.apache.org/dist/commons/KEYS
>
> Maven artifacts:
>
>
<https://repository.apache.org/content/repositories/orgapachecommons-1087/org/apache/commons/commons-math3/3.5/>
>
> [ ] +1 Release it.
> [ ] +0 Go ahead; I don't care.
> [ ] -0 There are a few minor glitches: ...
> [ ] -1 No, do not release it because ...
>
> This vote will close in 72 hours, at 2015-04-15T19:00:00Z (this is UTC
> time).



---------------------------------------------------------------------
To unsubscribe, e-mail: [hidden email]
For additional commands, e-mail: [hidden email]

Reply | Threaded
Open this post in threaded view
|

Re: [VOTE][RC1] Release Apache Commons Math 3.5

garydgregory
How about updating the platform req to Java 6 and be done with it?

Gary

On Mon, Apr 13, 2015 at 2:34 PM, Jörg Schaible <[hidden email]>
wrote:

> Hi Luc,
>
> -1, it claims to be Java 5 compatible, but it is not (at least not the
> tests):
>
> ============================== %< ========================
> $ mvn -P java-1.5 clean test
> [INFO] Scanning for projects...
> [INFO]
> [INFO]
> ------------------------------------------------------------------------
> [INFO] Building Apache Commons Math 3.5
> [INFO]
> ------------------------------------------------------------------------
> [INFO]
> [INFO] --- maven-clean-plugin:2.5:clean (default-clean) @ commons-math3 ---
> [INFO] Deleting /home/joehni/tmp/download/commons-math3-3.5-src/target
> [INFO]
> [INFO] --- maven-enforcer-plugin:1.3.1:enforce (enforce-maven-3) @ commons-
> math3 ---
> [INFO]
> [INFO] --- maven-antrun-plugin:1.7:run (javadoc.resources) @ commons-math3
> ---
> [INFO] Executing tasks
>
> main:
>      [copy] Copying 2 files to /home/joehni/tmp/download/commons-math3-3.5-
> src/target/apidocs/META-INF
> [INFO] Executed tasks
> [INFO]
> [INFO] --- maven-remote-resources-plugin:1.5:process (default) @ commons-
> math3 ---
> [INFO]
> [INFO] --- buildnumber-maven-plugin:1.2:create (default) @ commons-math3
> ---
> [INFO] Checking for local modifications: skipped.
> [INFO] Updating project files from SCM: skipped.
> [INFO] Executing: /bin/sh -c cd
> /home/joehni/tmp/download/commons-math3-3.5-
> src && git rev-parse --verify HEAD
> [INFO] Working directory: /home/joehni/tmp/download/commons-math3-3.5-src
> [INFO] Storing buildNumber: ?????? at timestamp: 1428960511127
> [INFO] Executing: /bin/sh -c cd
> /home/joehni/tmp/download/commons-math3-3.5-
> src && git rev-parse --verify HEAD
> [INFO] Working directory: /home/joehni/tmp/download/commons-math3-3.5-src
> [INFO] Storing buildScmBranch: UNKNOWN_BRANCH
> [INFO]
> [INFO] --- maven-jgit-buildnumber-plugin:1.2.8:extract-buildnumber
> (default)
> @ commons-math3 ---
> [ERROR]
> java.lang.IllegalArgumentException: One of setGitDir or setWorkTree must be
> called.
>         at
>
> org.eclipse.jgit.lib.BaseRepositoryBuilder.requireGitDirOrWorkTree(BaseRepositoryBuilder.java:582)
>         at
>
> org.eclipse.jgit.lib.BaseRepositoryBuilder.setup(BaseRepositoryBuilder.java:550)
>         at
>
> org.eclipse.jgit.storage.file.FileRepositoryBuilder.build(FileRepositoryBuilder.java:89)
>         at
>
> ru.concerteza.util.buildnumber.BuildNumberExtractor.extract(BuildNumberExtractor.java:38)
>         at
>
> ru.concerteza.util.buildnumber.JGitBuildNumberMojo.execute(JGitBuildNumberMojo.java:124)
>         at
>
> org.apache.maven.plugin.DefaultBuildPluginManager.executeMojo(DefaultBuildPluginManager.java:132)
>         at
>
> org.apache.maven.lifecycle.internal.MojoExecutor.execute(MojoExecutor.java:208)
>         at
>
> org.apache.maven.lifecycle.internal.MojoExecutor.execute(MojoExecutor.java:153)
>         at
>
> org.apache.maven.lifecycle.internal.MojoExecutor.execute(MojoExecutor.java:145)
>         at
>
> org.apache.maven.lifecycle.internal.LifecycleModuleBuilder.buildProject(LifecycleModuleBuilder.java:116)
>         at
>
> org.apache.maven.lifecycle.internal.LifecycleModuleBuilder.buildProject(LifecycleModuleBuilder.java:80)
>         at
>
> org.apache.maven.lifecycle.internal.builder.singlethreaded.SingleThreadedBuilder.build(SingleThreadedBuilder.java:51)
>         at
>
> org.apache.maven.lifecycle.internal.LifecycleStarter.execute(LifecycleStarter.java:120)
>         at org.apache.maven.DefaultMaven.doExecute(DefaultMaven.java:355)
>         at org.apache.maven.DefaultMaven.execute(DefaultMaven.java:155)
>         at org.apache.maven.cli.MavenCli.execute(MavenCli.java:584)
>         at org.apache.maven.cli.MavenCli.doMain(MavenCli.java:216)
>         at org.apache.maven.cli.MavenCli.main(MavenCli.java:160)
>         at sun.reflect.NativeMethodAccessorImpl.invoke0(Native Method)
>         at
>
> sun.reflect.NativeMethodAccessorImpl.invoke(NativeMethodAccessorImpl.java:57)
>         at
>
> sun.reflect.DelegatingMethodAccessorImpl.invoke(DelegatingMethodAccessorImpl.java:43)
>         at java.lang.reflect.Method.invoke(Method.java:606)
>         at
>
> org.codehaus.plexus.classworlds.launcher.Launcher.launchEnhanced(Launcher.java:289)
>         at
> org.codehaus.plexus.classworlds.launcher.Launcher.launch(Launcher.java:229)
>         at
>
> org.codehaus.plexus.classworlds.launcher.Launcher.mainWithExitCode(Launcher.java:415)
>         at
> org.codehaus.plexus.classworlds.launcher.Launcher.main(Launcher.java:356)
> [INFO]
> [INFO] --- maven-resources-plugin:2.6:resources (default-resources) @
> commons-math3 ---
> [INFO] Using 'UTF-8' encoding to copy filtered resources.
> [INFO] Copying 2 resources
> [INFO] Copying 2 resources to META-INF
> [INFO]
> [INFO] --- maven-compiler-plugin:3.1:compile (default-compile) @ commons-
> math3 ---
> [INFO] Changes detected - recompiling the module!
> [INFO] Compiling 927 source files to /home/joehni/tmp/download/commons-
> math3-3.5-src/target/classes
> [INFO]
> [INFO] --- maven-bundle-plugin:2.4.0:manifest (bundle-manifest) @ commons-
> math3 ---
> [INFO]
> [INFO] --- maven-resources-plugin:2.6:testResources (default-testResources)
> @ commons-math3 ---
> [INFO] Using 'UTF-8' encoding to copy filtered resources.
> [INFO] Copying 38 resources
> [INFO] Copying 2 resources to META-INF
> [INFO]
> [INFO] --- maven-compiler-plugin:3.1:testCompile (default-testCompile) @
> commons-math3 ---
> [INFO] Changes detected - recompiling the module!
> [INFO] Compiling 570 source files to /home/joehni/tmp/download/commons-
> math3-3.5-src/target/test-classes
> [INFO] -------------------------------------------------------------
> [ERROR] COMPILATION ERROR :
> [INFO] -------------------------------------------------------------
> [ERROR] /home/joehni/tmp/download/commons-math3-3.5-
>
> src/src/test/java/org/apache/commons/math3/geometry/partitioning/RegionDumper.java:
> [207,9] method does not override a method from its superclass
> [ERROR] /home/joehni/tmp/download/commons-math3-3.5-
>
> src/src/test/java/org/apache/commons/math3/geometry/partitioning/RegionDumper.java:
> [213,9] method does not override a method from its superclass
> [ERROR] /home/joehni/tmp/download/commons-math3-3.5-
>
> src/src/test/java/org/apache/commons/math3/geometry/partitioning/RegionDumper.java:
> [222,9] method does not override a method from its superclass
> [ERROR] /home/joehni/tmp/download/commons-math3-3.5-
>
> src/src/test/java/org/apache/commons/math3/geometry/euclidean/threed/PolyhedronsSetTest.java:
> [397,8] cannot find symbol
> symbol  : method
>
> checkError(java.util.List<org.apache.commons.math3.geometry.euclidean.threed.Vector3D>,java.util.List<<nulltype>[]>,org.apache.commons.math3.exception.util.LocalizedFormats)
> location: class
> org.apache.commons.math3.geometry.euclidean.threed.PolyhedronsSetTest
> [INFO] 4 errors
> [INFO] -------------------------------------------------------------
> [INFO]
> ------------------------------------------------------------------------
> [INFO] BUILD FAILURE
> [INFO]
> ------------------------------------------------------------------------
> [INFO] Total time: 17.806 s
> [INFO] Finished at: 2015-04-13T23:28:46+02:00
> [INFO] Final Memory: 18M/220M
> [INFO]
> ------------------------------------------------------------------------
> [ERROR] Failed to execute goal org.apache.maven.plugins:maven-compiler-
> plugin:3.1:testCompile (default-testCompile) on project commons-math3:
> Compilation failure: Compilation failure:
> [ERROR] /home/joehni/tmp/download/commons-math3-3.5-
>
> src/src/test/java/org/apache/commons/math3/geometry/partitioning/RegionDumper.java:
> [207,9] method does not override a method from its superclass
> [ERROR] /home/joehni/tmp/download/commons-math3-3.5-
>
> src/src/test/java/org/apache/commons/math3/geometry/partitioning/RegionDumper.java:
> [213,9] method does not override a method from its superclass
> [ERROR] /home/joehni/tmp/download/commons-math3-3.5-
>
> src/src/test/java/org/apache/commons/math3/geometry/partitioning/RegionDumper.java:
> [222,9] method does not override a method from its superclass
> [ERROR] /home/joehni/tmp/download/commons-math3-3.5-
>
> src/src/test/java/org/apache/commons/math3/geometry/euclidean/threed/PolyhedronsSetTest.java:
> [397,8] cannot find symbol
> [ERROR] symbol  : method
>
> checkError(java.util.List<org.apache.commons.math3.geometry.euclidean.threed.Vector3D>,java.util.List<<nulltype>[]>,org.apache.commons.math3.exception.util.LocalizedFormats)
> [ERROR] location: class
> org.apache.commons.math3.geometry.euclidean.threed.PolyhedronsSetTest
> [ERROR] -> [Help 1]
> [ERROR]
> [ERROR] To see the full stack trace of the errors, re-run Maven with the -e
> switch.
> [ERROR] Re-run Maven using the -X switch to enable full debug logging.
> [ERROR]
> [ERROR] For more information about the errors and possible solutions,
> please
> read the following articles:
> [ERROR] [Help 1]
> http://cwiki.apache.org/confluence/display/MAVEN/MojoFailureException
> ============================== %< ========================
>
> Cheers,
> Jörg
>
> Luc Maisonobe wrote:
>
> > This is a [VOTE] for releasing Apache Commons Math 3.5 from release
> > candidate 1.
> >
> > Tag name: MATH_3_5_RC1 (signature can be checked from git using 'git tag
> > -v')
> >
> > Tag URL:
> >
> > <
> https://git-wip-us.apache.org/repos/asf?p=commons-math.git;a=commit;h=7efda3f0a0941362e9e4152d0e0e92872a8ce8d3
> >
> >
> > Commit ID the tag points at: 7efda3f0a0941362e9e4152d0e0e92872a8ce8d3
> >
> > Site: <http://people.apache.org/~luc/commons-math-3.5-RC1-site>
> >
> > Distribution files: https://dist.apache.org/repos/dist/dev/commons/math/
> >
> > Distribution files hashes (SHA1):
> > 3a06c6297f4975b6a5f32bacdfad126c8cec94b7 commons-math3-3.5-bin.tar.gz
> > 2873864620239f4a3efd3d088f06fbd2d533b224 commons-math3-3.5-bin.zip
> > 7ff72a98ea2da18dda7846adc699a18893b8c26b commons-math3-3.5-src.tar.gz
> > 2838050ebe95fb5456e1eca15af1e005b08011fa commons-math3-3.5-src.zip
> >
> > The svn commit revision for the distribution files above is r8586.
> >
> > KEYS file to check signatures: http://www.apache.org/dist/commons/KEYS
> >
> > Maven artifacts:
> >
> >
> <
> https://repository.apache.org/content/repositories/orgapachecommons-1087/org/apache/commons/commons-math3/3.5/
> >
> >
> > [ ] +1 Release it.
> > [ ] +0 Go ahead; I don't care.
> > [ ] -0 There are a few minor glitches: ...
> > [ ] -1 No, do not release it because ...
> >
> > This vote will close in 72 hours, at 2015-04-15T19:00:00Z (this is UTC
> > time).
>
>
>
> ---------------------------------------------------------------------
> To unsubscribe, e-mail: [hidden email]
> For additional commands, e-mail: [hidden email]
>
>


--
E-Mail: [hidden email] | [hidden email]
Java Persistence with Hibernate, Second Edition
<http://www.manning.com/bauer3/>
JUnit in Action, Second Edition <http://www.manning.com/tahchiev/>
Spring Batch in Action <http://www.manning.com/templier/>
Blog: http://garygregory.wordpress.com
Home: http://garygregory.com/
Tweet! http://twitter.com/GaryGregory
Reply | Threaded
Open this post in threaded view
|

Re: [VOTE][RC1] Release Apache Commons Math 3.5

Luc Maisonobe-2
Le 14/04/2015 00:12, Gary Gregory a écrit :
> How about updating the platform req to Java 6 and be done with it?

Then it would not be compatible with previous 3.X :-(
We have upgraded to Java 7 with next major release (4.0), but this one
is still in the 3.X branch.

>
> Gary
>
> On Mon, Apr 13, 2015 at 2:34 PM, Jörg Schaible <[hidden email]>
> wrote:
>
>> Hi Luc,
>>
>> -1, it claims to be Java 5 compatible, but it is not (at least not the
>> tests):

Weird ... I'll run another RC then.

Thanks for the report.

best regards,
Luc

>>
>> ============================== %< ========================
>> $ mvn -P java-1.5 clean test
>> [INFO] Scanning for projects...
>> [INFO]
>> [INFO]
>> ------------------------------------------------------------------------
>> [INFO] Building Apache Commons Math 3.5
>> [INFO]
>> ------------------------------------------------------------------------
>> [INFO]
>> [INFO] --- maven-clean-plugin:2.5:clean (default-clean) @ commons-math3 ---
>> [INFO] Deleting /home/joehni/tmp/download/commons-math3-3.5-src/target
>> [INFO]
>> [INFO] --- maven-enforcer-plugin:1.3.1:enforce (enforce-maven-3) @ commons-
>> math3 ---
>> [INFO]
>> [INFO] --- maven-antrun-plugin:1.7:run (javadoc.resources) @ commons-math3
>> ---
>> [INFO] Executing tasks
>>
>> main:
>>      [copy] Copying 2 files to /home/joehni/tmp/download/commons-math3-3.5-
>> src/target/apidocs/META-INF
>> [INFO] Executed tasks
>> [INFO]
>> [INFO] --- maven-remote-resources-plugin:1.5:process (default) @ commons-
>> math3 ---
>> [INFO]
>> [INFO] --- buildnumber-maven-plugin:1.2:create (default) @ commons-math3
>> ---
>> [INFO] Checking for local modifications: skipped.
>> [INFO] Updating project files from SCM: skipped.
>> [INFO] Executing: /bin/sh -c cd
>> /home/joehni/tmp/download/commons-math3-3.5-
>> src && git rev-parse --verify HEAD
>> [INFO] Working directory: /home/joehni/tmp/download/commons-math3-3.5-src
>> [INFO] Storing buildNumber: ?????? at timestamp: 1428960511127
>> [INFO] Executing: /bin/sh -c cd
>> /home/joehni/tmp/download/commons-math3-3.5-
>> src && git rev-parse --verify HEAD
>> [INFO] Working directory: /home/joehni/tmp/download/commons-math3-3.5-src
>> [INFO] Storing buildScmBranch: UNKNOWN_BRANCH
>> [INFO]
>> [INFO] --- maven-jgit-buildnumber-plugin:1.2.8:extract-buildnumber
>> (default)
>> @ commons-math3 ---
>> [ERROR]
>> java.lang.IllegalArgumentException: One of setGitDir or setWorkTree must be
>> called.
>>         at
>>
>> org.eclipse.jgit.lib.BaseRepositoryBuilder.requireGitDirOrWorkTree(BaseRepositoryBuilder.java:582)
>>         at
>>
>> org.eclipse.jgit.lib.BaseRepositoryBuilder.setup(BaseRepositoryBuilder.java:550)
>>         at
>>
>> org.eclipse.jgit.storage.file.FileRepositoryBuilder.build(FileRepositoryBuilder.java:89)
>>         at
>>
>> ru.concerteza.util.buildnumber.BuildNumberExtractor.extract(BuildNumberExtractor.java:38)
>>         at
>>
>> ru.concerteza.util.buildnumber.JGitBuildNumberMojo.execute(JGitBuildNumberMojo.java:124)
>>         at
>>
>> org.apache.maven.plugin.DefaultBuildPluginManager.executeMojo(DefaultBuildPluginManager.java:132)
>>         at
>>
>> org.apache.maven.lifecycle.internal.MojoExecutor.execute(MojoExecutor.java:208)
>>         at
>>
>> org.apache.maven.lifecycle.internal.MojoExecutor.execute(MojoExecutor.java:153)
>>         at
>>
>> org.apache.maven.lifecycle.internal.MojoExecutor.execute(MojoExecutor.java:145)
>>         at
>>
>> org.apache.maven.lifecycle.internal.LifecycleModuleBuilder.buildProject(LifecycleModuleBuilder.java:116)
>>         at
>>
>> org.apache.maven.lifecycle.internal.LifecycleModuleBuilder.buildProject(LifecycleModuleBuilder.java:80)
>>         at
>>
>> org.apache.maven.lifecycle.internal.builder.singlethreaded.SingleThreadedBuilder.build(SingleThreadedBuilder.java:51)
>>         at
>>
>> org.apache.maven.lifecycle.internal.LifecycleStarter.execute(LifecycleStarter.java:120)
>>         at org.apache.maven.DefaultMaven.doExecute(DefaultMaven.java:355)
>>         at org.apache.maven.DefaultMaven.execute(DefaultMaven.java:155)
>>         at org.apache.maven.cli.MavenCli.execute(MavenCli.java:584)
>>         at org.apache.maven.cli.MavenCli.doMain(MavenCli.java:216)
>>         at org.apache.maven.cli.MavenCli.main(MavenCli.java:160)
>>         at sun.reflect.NativeMethodAccessorImpl.invoke0(Native Method)
>>         at
>>
>> sun.reflect.NativeMethodAccessorImpl.invoke(NativeMethodAccessorImpl.java:57)
>>         at
>>
>> sun.reflect.DelegatingMethodAccessorImpl.invoke(DelegatingMethodAccessorImpl.java:43)
>>         at java.lang.reflect.Method.invoke(Method.java:606)
>>         at
>>
>> org.codehaus.plexus.classworlds.launcher.Launcher.launchEnhanced(Launcher.java:289)
>>         at
>> org.codehaus.plexus.classworlds.launcher.Launcher.launch(Launcher.java:229)
>>         at
>>
>> org.codehaus.plexus.classworlds.launcher.Launcher.mainWithExitCode(Launcher.java:415)
>>         at
>> org.codehaus.plexus.classworlds.launcher.Launcher.main(Launcher.java:356)
>> [INFO]
>> [INFO] --- maven-resources-plugin:2.6:resources (default-resources) @
>> commons-math3 ---
>> [INFO] Using 'UTF-8' encoding to copy filtered resources.
>> [INFO] Copying 2 resources
>> [INFO] Copying 2 resources to META-INF
>> [INFO]
>> [INFO] --- maven-compiler-plugin:3.1:compile (default-compile) @ commons-
>> math3 ---
>> [INFO] Changes detected - recompiling the module!
>> [INFO] Compiling 927 source files to /home/joehni/tmp/download/commons-
>> math3-3.5-src/target/classes
>> [INFO]
>> [INFO] --- maven-bundle-plugin:2.4.0:manifest (bundle-manifest) @ commons-
>> math3 ---
>> [INFO]
>> [INFO] --- maven-resources-plugin:2.6:testResources (default-testResources)
>> @ commons-math3 ---
>> [INFO] Using 'UTF-8' encoding to copy filtered resources.
>> [INFO] Copying 38 resources
>> [INFO] Copying 2 resources to META-INF
>> [INFO]
>> [INFO] --- maven-compiler-plugin:3.1:testCompile (default-testCompile) @
>> commons-math3 ---
>> [INFO] Changes detected - recompiling the module!
>> [INFO] Compiling 570 source files to /home/joehni/tmp/download/commons-
>> math3-3.5-src/target/test-classes
>> [INFO] -------------------------------------------------------------
>> [ERROR] COMPILATION ERROR :
>> [INFO] -------------------------------------------------------------
>> [ERROR] /home/joehni/tmp/download/commons-math3-3.5-
>>
>> src/src/test/java/org/apache/commons/math3/geometry/partitioning/RegionDumper.java:
>> [207,9] method does not override a method from its superclass
>> [ERROR] /home/joehni/tmp/download/commons-math3-3.5-
>>
>> src/src/test/java/org/apache/commons/math3/geometry/partitioning/RegionDumper.java:
>> [213,9] method does not override a method from its superclass
>> [ERROR] /home/joehni/tmp/download/commons-math3-3.5-
>>
>> src/src/test/java/org/apache/commons/math3/geometry/partitioning/RegionDumper.java:
>> [222,9] method does not override a method from its superclass
>> [ERROR] /home/joehni/tmp/download/commons-math3-3.5-
>>
>> src/src/test/java/org/apache/commons/math3/geometry/euclidean/threed/PolyhedronsSetTest.java:
>> [397,8] cannot find symbol
>> symbol  : method
>>
>> checkError(java.util.List<org.apache.commons.math3.geometry.euclidean.threed.Vector3D>,java.util.List<<nulltype>[]>,org.apache.commons.math3.exception.util.LocalizedFormats)
>> location: class
>> org.apache.commons.math3.geometry.euclidean.threed.PolyhedronsSetTest
>> [INFO] 4 errors
>> [INFO] -------------------------------------------------------------
>> [INFO]
>> ------------------------------------------------------------------------
>> [INFO] BUILD FAILURE
>> [INFO]
>> ------------------------------------------------------------------------
>> [INFO] Total time: 17.806 s
>> [INFO] Finished at: 2015-04-13T23:28:46+02:00
>> [INFO] Final Memory: 18M/220M
>> [INFO]
>> ------------------------------------------------------------------------
>> [ERROR] Failed to execute goal org.apache.maven.plugins:maven-compiler-
>> plugin:3.1:testCompile (default-testCompile) on project commons-math3:
>> Compilation failure: Compilation failure:
>> [ERROR] /home/joehni/tmp/download/commons-math3-3.5-
>>
>> src/src/test/java/org/apache/commons/math3/geometry/partitioning/RegionDumper.java:
>> [207,9] method does not override a method from its superclass
>> [ERROR] /home/joehni/tmp/download/commons-math3-3.5-
>>
>> src/src/test/java/org/apache/commons/math3/geometry/partitioning/RegionDumper.java:
>> [213,9] method does not override a method from its superclass
>> [ERROR] /home/joehni/tmp/download/commons-math3-3.5-
>>
>> src/src/test/java/org/apache/commons/math3/geometry/partitioning/RegionDumper.java:
>> [222,9] method does not override a method from its superclass
>> [ERROR] /home/joehni/tmp/download/commons-math3-3.5-
>>
>> src/src/test/java/org/apache/commons/math3/geometry/euclidean/threed/PolyhedronsSetTest.java:
>> [397,8] cannot find symbol
>> [ERROR] symbol  : method
>>
>> checkError(java.util.List<org.apache.commons.math3.geometry.euclidean.threed.Vector3D>,java.util.List<<nulltype>[]>,org.apache.commons.math3.exception.util.LocalizedFormats)
>> [ERROR] location: class
>> org.apache.commons.math3.geometry.euclidean.threed.PolyhedronsSetTest
>> [ERROR] -> [Help 1]
>> [ERROR]
>> [ERROR] To see the full stack trace of the errors, re-run Maven with the -e
>> switch.
>> [ERROR] Re-run Maven using the -X switch to enable full debug logging.
>> [ERROR]
>> [ERROR] For more information about the errors and possible solutions,
>> please
>> read the following articles:
>> [ERROR] [Help 1]
>> http://cwiki.apache.org/confluence/display/MAVEN/MojoFailureException
>> ============================== %< ========================
>>
>> Cheers,
>> Jörg
>>
>> Luc Maisonobe wrote:
>>
>>> This is a [VOTE] for releasing Apache Commons Math 3.5 from release
>>> candidate 1.
>>>
>>> Tag name: MATH_3_5_RC1 (signature can be checked from git using 'git tag
>>> -v')
>>>
>>> Tag URL:
>>>
>>> <
>> https://git-wip-us.apache.org/repos/asf?p=commons-math.git;a=commit;h=7efda3f0a0941362e9e4152d0e0e92872a8ce8d3
>>>
>>>
>>> Commit ID the tag points at: 7efda3f0a0941362e9e4152d0e0e92872a8ce8d3
>>>
>>> Site: <http://people.apache.org/~luc/commons-math-3.5-RC1-site>
>>>
>>> Distribution files: https://dist.apache.org/repos/dist/dev/commons/math/
>>>
>>> Distribution files hashes (SHA1):
>>> 3a06c6297f4975b6a5f32bacdfad126c8cec94b7 commons-math3-3.5-bin.tar.gz
>>> 2873864620239f4a3efd3d088f06fbd2d533b224 commons-math3-3.5-bin.zip
>>> 7ff72a98ea2da18dda7846adc699a18893b8c26b commons-math3-3.5-src.tar.gz
>>> 2838050ebe95fb5456e1eca15af1e005b08011fa commons-math3-3.5-src.zip
>>>
>>> The svn commit revision for the distribution files above is r8586.
>>>
>>> KEYS file to check signatures: http://www.apache.org/dist/commons/KEYS
>>>
>>> Maven artifacts:
>>>
>>>
>> <
>> https://repository.apache.org/content/repositories/orgapachecommons-1087/org/apache/commons/commons-math3/3.5/
>>>
>>>
>>> [ ] +1 Release it.
>>> [ ] +0 Go ahead; I don't care.
>>> [ ] -0 There are a few minor glitches: ...
>>> [ ] -1 No, do not release it because ...
>>>
>>> This vote will close in 72 hours, at 2015-04-15T19:00:00Z (this is UTC
>>> time).
>>
>>
>>
>> ---------------------------------------------------------------------
>> To unsubscribe, e-mail: [hidden email]
>> For additional commands, e-mail: [hidden email]
>>
>>
>
>


---------------------------------------------------------------------
To unsubscribe, e-mail: [hidden email]
For additional commands, e-mail: [hidden email]

Reply | Threaded
Open this post in threaded view
|

[CANCELlED][VOTE][RC1] Release Apache Commons Math 3.5

Luc Maisonobe-2
In reply to this post by Luc Maisonobe-2
Le 12/04/2015 20:38, Luc Maisonobe a écrit :
> This is a [VOTE] for releasing Apache Commons Math 3.5 from release
> candidate 1.

This vote is cancelled due to incompatibilities found in the tests.

thanks to all those who voted.

best regards,
Luc

>
> Tag name: MATH_3_5_RC1 (signature can be checked from git using 'git tag
> -v')
>
> Tag URL:
>
> <https://git-wip-us.apache.org/repos/asf?p=commons-math.git;a=commit;h=7efda3f0a0941362e9e4152d0e0e92872a8ce8d3>
>
> Commit ID the tag points at: 7efda3f0a0941362e9e4152d0e0e92872a8ce8d3
>
> Site: <http://people.apache.org/~luc/commons-math-3.5-RC1-site>
>
> Distribution files: https://dist.apache.org/repos/dist/dev/commons/math/
>
> Distribution files hashes (SHA1):
> 3a06c6297f4975b6a5f32bacdfad126c8cec94b7 commons-math3-3.5-bin.tar.gz
> 2873864620239f4a3efd3d088f06fbd2d533b224 commons-math3-3.5-bin.zip
> 7ff72a98ea2da18dda7846adc699a18893b8c26b commons-math3-3.5-src.tar.gz
> 2838050ebe95fb5456e1eca15af1e005b08011fa commons-math3-3.5-src.zip
>
> The svn commit revision for the distribution files above is r8586.
>
> KEYS file to check signatures: http://www.apache.org/dist/commons/KEYS
>
> Maven artifacts:
>
> <https://repository.apache.org/content/repositories/orgapachecommons-1087/org/apache/commons/commons-math3/3.5/>
>
> [ ] +1 Release it.
> [ ] +0 Go ahead; I don't care.
> [ ] -0 There are a few minor glitches: ...
> [ ] -1 No, do not release it because ...
>
> This vote will close in 72 hours, at 2015-04-15T19:00:00Z (this is UTC
> time).
>
>
> ---------------------------------------------------------------------
> To unsubscribe, e-mail: [hidden email]
> For additional commands, e-mail: [hidden email]
>
>
>


---------------------------------------------------------------------
To unsubscribe, e-mail: [hidden email]
For additional commands, e-mail: [hidden email]