[VOTE] Release Compress 1.18 based on RC1

classic Classic list List threaded Threaded
12 messages Options
Reply | Threaded
Open this post in threaded view
|

[VOTE] Release Compress 1.18 based on RC1

Stefan Bodewig
Hi all,

I would like to release Compress 1.18.

Compress 1.18 RC1 is available for review here:
    https://dist.apache.org/repos/dist/dev/commons/compress/ (svn revision 28684)

The tag is here:
    tag 1.18-RC1 on commit b95d5cde
    https://git-wip-us.apache.org/repos/asf?p=commons-compress.git;a=commit;h=b95d5cde4c68640f886e3c6802384fae47408a37

Maven artifacts are here:
    https://repository.apache.org/content/repositories/orgapachecommons-1367/org/apache/commons/commons-compress/1.18/

These are the Maven artifacts and their SHA256 hashes

5f2df1e467825e4cac5996d44890c4201c000b43c0b23cffc0782d28a0beb9b0  commons-compress-1.18.jar
23b382156431d6350745c571e533fabe28aebe8da1de6e039e8e480bb9764dfc  commons-compress-1.18-javadoc.jar
c8e6896eb3d3880ffc21bb93d563b7cc0d3e2152c8181f261a748502290a5947  commons-compress-1.18-sources.jar
630a8c16d58d2d7475c82a98b032390831d22589bccd0f9086e95e85742a41b3  commons-compress-1.18-tests.jar
ea06230ae8f1ef954da571d3bb13c2324fee703d7cfee2699a76d3793b531cec  commons-compress-1.18-test-sources.jar
672c5fe92bd3eab43e8d53338cad5ca073b6529de4eb2b38859a3eaa6c9e8119  commons-compress-1.18.pom

I have tested this with JDK 8 using Maven 3.5.4.

Details of changes since 1.17 are in the release notes:
    https://dist.apache.org/repos/dist/dev/commons/compress/RELEASE-NOTES.txt
    https://stefan.samaflost.de/staging/commons-compress-1.18/changes-report.html

Site:
    https://stefan.samaflost.de/staging/commons-compress-1.18/

    as usual this is not the site I'm going to publish after the
    release, I'll re-create the site when the release date is
    clear. The download link and 1.18 javadoc link won't work right
    now.

japicmp Report (compared to 1.17):
    https://stefan.samaflost.de/staging/commons-compress-1.18/japicmp.html

RAT Report:
    https://stefan.samaflost.de/staging/commons-compress-1.18/rat-report.html

KEYS:
  https://www.apache.org/dist/commons/KEYS

Please review the release candidate and vote.
This vote will close no sooner that 72 hours from now,
i.e. sometime after 08:00 UTC 16-August 2018

  [ ] +1 Release these artifacts
  [ ] +0 OK, but...
  [ ] -0 OK, but really should fix...
  [ ] -1 I oppose this release because...

Thanks!

        Stefan

---------------------------------------------------------------------
To unsubscribe, e-mail: [hidden email]
For additional commands, e-mail: [hidden email]

Reply | Threaded
Open this post in threaded view
|

Re: [VOTE] Release Compress 1.18 based on RC1

garydgregory
+1

From src zip: ASC, SHA256 OK.
In the future we should only publish SHA512 hashes.

Site typo: "It is no possible to specifiy various parameters for Zstd
output."
-> "It is *now *possible to *specify *various parameters for Zstd output."

changes.xml needs a release date (I usually try to remember to do this as
part of the RC.)

mvn clean package site OK
mvn apache-rat:check OK
mvn clirr:check OK
mvn clean install -DskipTests japicmp:cmp OK writing
C:\temp\rc\commons-compress-1.18-src\target\japicmp\default-cli.html OK

What does this mean:

[INFO] Skipping JaCoCo execution due to missing execution data file.
Aug 13, 2018 12:05:21 PM
net.sourceforge.pmd.lang.java.typeresolution.ClassTypeResolver visit
WARNING: Could not find class
org.apache.commons.compress.archivers.sevenz.LZMADecoder, due to:
java.lang.IllegalAccessError: class
org.apache.commons.compress.archivers.sevenz.LZMADecoder cannot access its
superclass org.apache.commons.compress.archivers.sevenz.CoderBase

?

Nit:

[INFO] --- maven-compiler-plugin:3.7.0:compile (default-compile) @
commons-compress ---
[INFO] Changes detected - recompiling the module!
[INFO] Compiling 206 source files to
C:\temp\rc\commons-compress-1.18-src\target\classes
[INFO]
/C:/temp/rc/commons-compress-1.18-src/src/main/java/org/apache/commons/compress/utils/Sets.java:
C:\temp\rc\commons-compress-1.18-src\src\main\java\org\apache\commons\compress\utils\Sets.java
uses unchecked or unsafe operations.
[INFO]
/C:/temp/rc/commons-compress-1.18-src/src/main/java/org/apache/commons/compress/utils/Sets.java:
Recompile with -Xlint:unchecked for details.

Too bad we get multiple instances of ProjectBuildingException:

[INFO] <<< jdepend-maven-plugin:2.0:generate < compile @ commons-compress
<<<
[INFO]
[INFO] 'compile' forked phase execution for jdepend-maven-plugin:generate
report preparation done
[INFO] 2 reports detected for jdepend-maven-plugin:2.0: generate-no-fork,
generate
[INFO] configuring report plugin
com.github.siom79.japicmp:japicmp-maven-plugin:0.11.1
[INFO] 1 report detected for japicmp-maven-plugin:0.11.1: cmp-report
[INFO] configuring report plugin org.jacoco:jacoco-maven-plugin:0.8.1
[INFO] 3 reports detected for jacoco-maven-plugin:0.8.1: report,
report-aggregate, report-integration
[INFO] configuring report plugin
org.apache.maven.plugins:maven-pmd-plugin:3.8
[INFO] 2 reports detected for maven-pmd-plugin:3.8: cpd, pmd
[INFO] configuring report plugin
org.codehaus.mojo:findbugs-maven-plugin:3.0.5
[INFO] 1 report detected for findbugs-maven-plugin:3.0.5: findbugs
[INFO] Skipping JaCoCo execution due to missing execution data file.
Aug 13, 2018 12:11:59 PM
net.sourceforge.pmd.lang.java.typeresolution.ClassTypeResolver visit
WARNING: Could not find class
org.apache.commons.compress.archivers.sevenz.LZMADecoder, due to:
java.lang.IllegalAccessError: class
org.apache.commons.compress.archivers.sevenz.LZMADecoder cannot access its
superclass org.apache.commons.compress.archivers.sevenz.CoderBase
[INFO] Fork Value is true
[INFO] Done FindBugs Analysis....
[INFO] Rendering site with default locale English (en)
[INFO] Relativizing decoration links with respect to localized project URL:
https://commons.apache.org/proper/commons-compress/
[INFO] Rendering content with org.apache.commons:commons-skin:jar:4.1 skin.
[INFO] Skipped "About" report
(maven-project-info-reports-plugin:3.0.0:index), file "index.html" already
exists.
[INFO] Skipped "Surefire Report" report
(maven-surefire-report-plugin:2.22.0:report-only), file
"surefire-report.html" already exists.
[INFO] Skipped "JDepend" report (jdepend-maven-plugin:2.0:generate), file
"jdepend-report.html" already exists.
[INFO] Rendering 11 Doxia documents: 11 xdoc
[WARNING] [XHTML Sink] No HTML tag found for unknown event: 'codee',
ignoring!
[INFO] Generating "Changes" report       ---
maven-changes-plugin:2.12.1:changes-report
[INFO] Generating "JIRA Report" report   ---
maven-changes-plugin:2.12.1:jira-report
[INFO] The JIRA Report will contain issues only for the current version.
[INFO] Generating "Javadoc" report       ---
maven-javadoc-plugin:3.0.1:javadoc
[INFO] Generating "Source Xref" report   --- maven-jxr-plugin:2.5:jxr
[INFO] Generating "Test Source Xref" report ---
maven-jxr-plugin:2.5:test-jxr
[INFO] Generating "Summary" report       ---
maven-project-info-reports-plugin:3.0.0:summary
[INFO] Generating "Team" report          ---
maven-project-info-reports-plugin:3.0.0:team
[INFO] Generating "Source Code Management" report ---
maven-project-info-reports-plugin:3.0.0:scm
[INFO] Generating "Issue Management" report ---
maven-project-info-reports-plugin:3.0.0:issue-management
[INFO] Generating "Mailing Lists" report ---
maven-project-info-reports-plugin:3.0.0:mailing-lists
[INFO] Generating "Dependency Information" report ---
maven-project-info-reports-plugin:3.0.0:dependency-info
[INFO] Generating "Dependencies" report  ---
maven-project-info-reports-plugin:3.0.0:dependencies
[WARNING] Unable to create Maven project from repository.
org.apache.maven.project.ProjectBuildingException: Some problems were
encountered while processing the POMs:
[ERROR] Unknown packaging: bundle @ line 6, column 16

    at org.apache.maven.project.DefaultProjectBuilder.build
(DefaultProjectBuilder.java:192)
    at org.apache.maven.project.DefaultProjectBuilder.build
(DefaultProjectBuilder.java:327)
    at
org.apache.maven.report.projectinfo.dependencies.RepositoryUtils.getMavenProjectFromRepository
(RepositoryUtils.java:125)
    at
org.apache.maven.report.projectinfo.dependencies.renderer.DependenciesRenderer.renderArtifactRow
(DependenciesRenderer.java:799)
    at
org.apache.maven.report.projectinfo.dependencies.renderer.DependenciesRenderer.renderDependenciesForScope
(DependenciesRenderer.java:749)
    at
org.apache.maven.report.projectinfo.dependencies.renderer.DependenciesRenderer.renderDependenciesForAllScopes
(DependenciesRenderer.java:413)
    at
org.apache.maven.report.projectinfo.dependencies.renderer.DependenciesRenderer.renderSectionProjectDependencies
(DependenciesRenderer.java:397)
    at
org.apache.maven.report.projectinfo.dependencies.renderer.DependenciesRenderer.renderBody
(DependenciesRenderer.java:216)
    at org.apache.maven.reporting.AbstractMavenReportRenderer.render
(AbstractMavenReportRenderer.java:80)
    at org.apache.maven.report.projectinfo.DependenciesReport.executeReport
(DependenciesReport.java:162)
    at org.apache.maven.reporting.AbstractMavenReport.generate
(AbstractMavenReport.java:251)
    at
org.apache.maven.plugins.site.render.ReportDocumentRenderer.renderDocument
(ReportDocumentRenderer.java:230)
    at org.apache.maven.doxia.siterenderer.DefaultSiteRenderer.render
(DefaultSiteRenderer.java:349)
    at org.apache.maven.plugins.site.render.SiteMojo.renderLocale
(SiteMojo.java:198)
    at org.apache.maven.plugins.site.render.SiteMojo.execute
(SiteMojo.java:147)
    at org.apache.maven.plugin.DefaultBuildPluginManager.executeMojo
(DefaultBuildPluginManager.java:137)
    at org.apache.maven.lifecycle.internal.MojoExecutor.execute
(MojoExecutor.java:208)
    at org.apache.maven.lifecycle.internal.MojoExecutor.execute
(MojoExecutor.java:154)
    at org.apache.maven.lifecycle.internal.MojoExecutor.execute
(MojoExecutor.java:146)
    at
org.apache.maven.lifecycle.internal.LifecycleModuleBuilder.buildProject
(LifecycleModuleBuilder.java:117)
    at
org.apache.maven.lifecycle.internal.LifecycleModuleBuilder.buildProject
(LifecycleModuleBuilder.java:81)
    at
org.apache.maven.lifecycle.internal.builder.singlethreaded.SingleThreadedBuilder.build
(SingleThreadedBuilder.java:56)
    at org.apache.maven.lifecycle.internal.LifecycleStarter.execute
(LifecycleStarter.java:128)
    at org.apache.maven.DefaultMaven.doExecute (DefaultMaven.java:305)
    at org.apache.maven.DefaultMaven.doExecute (DefaultMaven.java:192)
    at org.apache.maven.DefaultMaven.execute (DefaultMaven.java:105)
    at org.apache.maven.cli.MavenCli.execute (MavenCli.java:954)
    at org.apache.maven.cli.MavenCli.doMain (MavenCli.java:288)
    at org.apache.maven.cli.MavenCli.main (MavenCli.java:192)
    at sun.reflect.NativeMethodAccessorImpl.invoke0 (Native Method)
    at sun.reflect.NativeMethodAccessorImpl.invoke
(NativeMethodAccessorImpl.java:62)
    at sun.reflect.DelegatingMethodAccessorImpl.invoke
(DelegatingMethodAccessorImpl.java:43)
    at java.lang.reflect.Method.invoke (Method.java:498)
    at org.codehaus.plexus.classworlds.launcher.Launcher.launchEnhanced
(Launcher.java:289)
    at org.codehaus.plexus.classworlds.launcher.Launcher.launch
(Launcher.java:229)
    at org.codehaus.plexus.classworlds.launcher.Launcher.mainWithExitCode
(Launcher.java:415)
    at org.codehaus.plexus.classworlds.launcher.Launcher.main
(Launcher.java:356)
Caused by: org.apache.maven.model.building.ModelBuildingException: 1
problem was encountered while building the effective model for
com.github.luben:zstd-jni:1.3.3-3
[ERROR] Unknown packaging: bundle @ line 6, column 16

    at
org.apache.maven.model.building.DefaultModelProblemCollector.newModelBuildingException
(DefaultModelProblemCollector.java:197)
    at org.apache.maven.model.building.DefaultModelBuilder.build
(DefaultModelBuilder.java:482)
    at org.apache.maven.model.building.DefaultModelBuilder.build
(DefaultModelBuilder.java:424)
    at org.apache.maven.model.building.DefaultModelBuilder.build
(DefaultModelBuilder.java:414)
    at org.apache.maven.project.DefaultProjectBuilder.build
(DefaultProjectBuilder.java:158)
    at org.apache.maven.project.DefaultProjectBuilder.build
(DefaultProjectBuilder.java:327)
    at
org.apache.maven.report.projectinfo.dependencies.RepositoryUtils.getMavenProjectFromRepository
(RepositoryUtils.java:125)
    at
org.apache.maven.report.projectinfo.dependencies.renderer.DependenciesRenderer.renderArtifactRow
(DependenciesRenderer.java:799)
    at
org.apache.maven.report.projectinfo.dependencies.renderer.DependenciesRenderer.renderDependenciesForScope
(DependenciesRenderer.java:749)
    at
org.apache.maven.report.projectinfo.dependencies.renderer.DependenciesRenderer.renderDependenciesForAllScopes
(DependenciesRenderer.java:413)
    at
org.apache.maven.report.projectinfo.dependencies.renderer.DependenciesRenderer.renderSectionProjectDependencies
(DependenciesRenderer.java:397)
    at
org.apache.maven.report.projectinfo.dependencies.renderer.DependenciesRenderer.renderBody
(DependenciesRenderer.java:216)
    at org.apache.maven.reporting.AbstractMavenReportRenderer.render
(AbstractMavenReportRenderer.java:80)
    at org.apache.maven.report.projectinfo.DependenciesReport.executeReport
(DependenciesReport.java:162)
    at org.apache.maven.reporting.AbstractMavenReport.generate
(AbstractMavenReport.java:251)
    at
org.apache.maven.plugins.site.render.ReportDocumentRenderer.renderDocument
(ReportDocumentRenderer.java:230)
    at org.apache.maven.doxia.siterenderer.DefaultSiteRenderer.render
(DefaultSiteRenderer.java:349)
    at org.apache.maven.plugins.site.render.SiteMojo.renderLocale
(SiteMojo.java:198)
    at org.apache.maven.plugins.site.render.SiteMojo.execute
(SiteMojo.java:147)
    at org.apache.maven.plugin.DefaultBuildPluginManager.executeMojo
(DefaultBuildPluginManager.java:137)
    at org.apache.maven.lifecycle.internal.MojoExecutor.execute
(MojoExecutor.java:208)
    at org.apache.maven.lifecycle.internal.MojoExecutor.execute
(MojoExecutor.java:154)
    at org.apache.maven.lifecycle.internal.MojoExecutor.execute
(MojoExecutor.java:146)
    at
org.apache.maven.lifecycle.internal.LifecycleModuleBuilder.buildProject
(LifecycleModuleBuilder.java:117)
    at
org.apache.maven.lifecycle.internal.LifecycleModuleBuilder.buildProject
(LifecycleModuleBuilder.java:81)
    at
org.apache.maven.lifecycle.internal.builder.singlethreaded.SingleThreadedBuilder.build
(SingleThreadedBuilder.java:56)
    at org.apache.maven.lifecycle.internal.LifecycleStarter.execute
(LifecycleStarter.java:128)
    at org.apache.maven.DefaultMaven.doExecute (DefaultMaven.java:305)
    at org.apache.maven.DefaultMaven.doExecute (DefaultMaven.java:192)
    at org.apache.maven.DefaultMaven.execute (DefaultMaven.java:105)
    at org.apache.maven.cli.MavenCli.execute (MavenCli.java:954)
    at org.apache.maven.cli.MavenCli.doMain (MavenCli.java:288)
    at org.apache.maven.cli.MavenCli.main (MavenCli.java:192)
    at sun.reflect.NativeMethodAccessorImpl.invoke0 (Native Method)
    at sun.reflect.NativeMethodAccessorImpl.invoke
(NativeMethodAccessorImpl.java:62)
    at sun.reflect.DelegatingMethodAccessorImpl.invoke
(DelegatingMethodAccessorImpl.java:43)
    at java.lang.reflect.Method.invoke (Method.java:498)
    at org.codehaus.plexus.classworlds.launcher.Launcher.launchEnhanced
(Launcher.java:289)
    at org.codehaus.plexus.classworlds.launcher.Launcher.launch
(Launcher.java:229)
    at org.codehaus.plexus.classworlds.launcher.Launcher.mainWithExitCode
(Launcher.java:415)
    at org.codehaus.plexus.classworlds.launcher.Launcher.main
(Launcher.java:356)
[WARNING] Unable to create Maven project from repository for artifact
com.github.luben:zstd-jni:jar:1.3.3-3
org.apache.maven.project.ProjectBuildingException: Some problems were
encountered while processing the POMs:
[ERROR] Unknown packaging: bundle @ line 6, column 16

    at org.apache.maven.project.DefaultProjectBuilder.build
(DefaultProjectBuilder.java:192)
    at org.apache.maven.project.DefaultProjectBuilder.build
(DefaultProjectBuilder.java:327)
    at
org.apache.maven.report.projectinfo.dependencies.RepositoryUtils.getMavenProjectFromRepository
(RepositoryUtils.java:125)
    at
org.apache.maven.report.projectinfo.dependencies.renderer.DependenciesRenderer.printDescriptionsAndURLs
(DependenciesRenderer.java:890)
    at
org.apache.maven.report.projectinfo.dependencies.renderer.DependenciesRenderer.printDependencyListing
(DependenciesRenderer.java:847)
    at
org.apache.maven.report.projectinfo.dependencies.renderer.DependenciesRenderer.printDependencyListing
(DependenciesRenderer.java:867)
    at
org.apache.maven.report.projectinfo.dependencies.renderer.DependenciesRenderer.renderSectionDependencyTree
(DependenciesRenderer.java:486)
    at
org.apache.maven.report.projectinfo.dependencies.renderer.DependenciesRenderer.renderSectionProjectDependencyGraph
(DependenciesRenderer.java:449)
    at
org.apache.maven.report.projectinfo.dependencies.renderer.DependenciesRenderer.renderBody
(DependenciesRenderer.java:222)
    at org.apache.maven.reporting.AbstractMavenReportRenderer.render
(AbstractMavenReportRenderer.java:80)
    at org.apache.maven.report.projectinfo.DependenciesReport.executeReport
(DependenciesReport.java:162)
    at org.apache.maven.reporting.AbstractMavenReport.generate
(AbstractMavenReport.java:251)
    at
org.apache.maven.plugins.site.render.ReportDocumentRenderer.renderDocument
(ReportDocumentRenderer.java:230)
    at org.apache.maven.doxia.siterenderer.DefaultSiteRenderer.render
(DefaultSiteRenderer.java:349)
    at org.apache.maven.plugins.site.render.SiteMojo.renderLocale
(SiteMojo.java:198)
    at org.apache.maven.plugins.site.render.SiteMojo.execute
(SiteMojo.java:147)
    at org.apache.maven.plugin.DefaultBuildPluginManager.executeMojo
(DefaultBuildPluginManager.java:137)
    at org.apache.maven.lifecycle.internal.MojoExecutor.execute
(MojoExecutor.java:208)
    at org.apache.maven.lifecycle.internal.MojoExecutor.execute
(MojoExecutor.java:154)
    at org.apache.maven.lifecycle.internal.MojoExecutor.execute
(MojoExecutor.java:146)
    at
org.apache.maven.lifecycle.internal.LifecycleModuleBuilder.buildProject
(LifecycleModuleBuilder.java:117)
    at
org.apache.maven.lifecycle.internal.LifecycleModuleBuilder.buildProject
(LifecycleModuleBuilder.java:81)
    at
org.apache.maven.lifecycle.internal.builder.singlethreaded.SingleThreadedBuilder.build
(SingleThreadedBuilder.java:56)
    at org.apache.maven.lifecycle.internal.LifecycleStarter.execute
(LifecycleStarter.java:128)
    at org.apache.maven.DefaultMaven.doExecute (DefaultMaven.java:305)
    at org.apache.maven.DefaultMaven.doExecute (DefaultMaven.java:192)
    at org.apache.maven.DefaultMaven.execute (DefaultMaven.java:105)
    at org.apache.maven.cli.MavenCli.execute (MavenCli.java:954)
    at org.apache.maven.cli.MavenCli.doMain (MavenCli.java:288)
    at org.apache.maven.cli.MavenCli.main (MavenCli.java:192)
    at sun.reflect.NativeMethodAccessorImpl.invoke0 (Native Method)
    at sun.reflect.NativeMethodAccessorImpl.invoke
(NativeMethodAccessorImpl.java:62)
    at sun.reflect.DelegatingMethodAccessorImpl.invoke
(DelegatingMethodAccessorImpl.java:43)
    at java.lang.reflect.Method.invoke (Method.java:498)
    at org.codehaus.plexus.classworlds.launcher.Launcher.launchEnhanced
(Launcher.java:289)
    at org.codehaus.plexus.classworlds.launcher.Launcher.launch
(Launcher.java:229)
    at org.codehaus.plexus.classworlds.launcher.Launcher.mainWithExitCode
(Launcher.java:415)
    at org.codehaus.plexus.classworlds.launcher.Launcher.main
(Launcher.java:356)
Caused by: org.apache.maven.model.building.ModelBuildingException: 1
problem was encountered while building the effective model for
com.github.luben:zstd-jni:1.3.3-3
[ERROR] Unknown packaging: bundle @ line 6, column 16

    at
org.apache.maven.model.building.DefaultModelProblemCollector.newModelBuildingException
(DefaultModelProblemCollector.java:197)
    at org.apache.maven.model.building.DefaultModelBuilder.build
(DefaultModelBuilder.java:482)
    at org.apache.maven.model.building.DefaultModelBuilder.build
(DefaultModelBuilder.java:424)
    at org.apache.maven.model.building.DefaultModelBuilder.build
(DefaultModelBuilder.java:414)
    at org.apache.maven.project.DefaultProjectBuilder.build
(DefaultProjectBuilder.java:158)
    at org.apache.maven.project.DefaultProjectBuilder.build
(DefaultProjectBuilder.java:327)
    at
org.apache.maven.report.projectinfo.dependencies.RepositoryUtils.getMavenProjectFromRepository
(RepositoryUtils.java:125)
    at
org.apache.maven.report.projectinfo.dependencies.renderer.DependenciesRenderer.printDescriptionsAndURLs
(DependenciesRenderer.java:890)
    at
org.apache.maven.report.projectinfo.dependencies.renderer.DependenciesRenderer.printDependencyListing
(DependenciesRenderer.java:847)
    at
org.apache.maven.report.projectinfo.dependencies.renderer.DependenciesRenderer.printDependencyListing
(DependenciesRenderer.java:867)
    at
org.apache.maven.report.projectinfo.dependencies.renderer.DependenciesRenderer.renderSectionDependencyTree
(DependenciesRenderer.java:486)
    at
org.apache.maven.report.projectinfo.dependencies.renderer.DependenciesRenderer.renderSectionProjectDependencyGraph
(DependenciesRenderer.java:449)
    at
org.apache.maven.report.projectinfo.dependencies.renderer.DependenciesRenderer.renderBody
(DependenciesRenderer.java:222)
    at org.apache.maven.reporting.AbstractMavenReportRenderer.render
(AbstractMavenReportRenderer.java:80)
    at org.apache.maven.report.projectinfo.DependenciesReport.executeReport
(DependenciesReport.java:162)
    at org.apache.maven.reporting.AbstractMavenReport.generate
(AbstractMavenReport.java:251)
    at
org.apache.maven.plugins.site.render.ReportDocumentRenderer.renderDocument
(ReportDocumentRenderer.java:230)
    at org.apache.maven.doxia.siterenderer.DefaultSiteRenderer.render
(DefaultSiteRenderer.java:349)
    at org.apache.maven.plugins.site.render.SiteMojo.renderLocale
(SiteMojo.java:198)
    at org.apache.maven.plugins.site.render.SiteMojo.execute
(SiteMojo.java:147)
    at org.apache.maven.plugin.DefaultBuildPluginManager.executeMojo
(DefaultBuildPluginManager.java:137)
    at org.apache.maven.lifecycle.internal.MojoExecutor.execute
(MojoExecutor.java:208)
    at org.apache.maven.lifecycle.internal.MojoExecutor.execute
(MojoExecutor.java:154)
    at org.apache.maven.lifecycle.internal.MojoExecutor.execute
(MojoExecutor.java:146)
    at
org.apache.maven.lifecycle.internal.LifecycleModuleBuilder.buildProject
(LifecycleModuleBuilder.java:117)
    at
org.apache.maven.lifecycle.internal.LifecycleModuleBuilder.buildProject
(LifecycleModuleBuilder.java:81)
    at
org.apache.maven.lifecycle.internal.builder.singlethreaded.SingleThreadedBuilder.build
(SingleThreadedBuilder.java:56)
    at org.apache.maven.lifecycle.internal.LifecycleStarter.execute
(LifecycleStarter.java:128)
    at org.apache.maven.DefaultMaven.doExecute (DefaultMaven.java:305)
    at org.apache.maven.DefaultMaven.doExecute (DefaultMaven.java:192)
    at org.apache.maven.DefaultMaven.execute (DefaultMaven.java:105)
    at org.apache.maven.cli.MavenCli.execute (MavenCli.java:954)
    at org.apache.maven.cli.MavenCli.doMain (MavenCli.java:288)
    at org.apache.maven.cli.MavenCli.main (MavenCli.java:192)
    at sun.reflect.NativeMethodAccessorImpl.invoke0 (Native Method)
    at sun.reflect.NativeMethodAccessorImpl.invoke
(NativeMethodAccessorImpl.java:62)
    at sun.reflect.DelegatingMethodAccessorImpl.invoke
(DelegatingMethodAccessorImpl.java:43)
    at java.lang.reflect.Method.invoke (Method.java:498)
    at org.codehaus.plexus.classworlds.launcher.Launcher.launchEnhanced
(Launcher.java:289)
    at org.codehaus.plexus.classworlds.launcher.Launcher.launch
(Launcher.java:229)
    at org.codehaus.plexus.classworlds.launcher.Launcher.mainWithExitCode
(Launcher.java:415)
    at org.codehaus.plexus.classworlds.launcher.Launcher.main
(Launcher.java:356)

Using 'mvn clean package site' with:

Apache Maven 3.5.4 (1edded0938998edf8bf061f1ceb3cfdeccf443fe;
2018-06-17T12:33:14-06:00)
Maven home: C:\Java\apache-maven-3.5.4\bin\..
Java version: 1.8.0_181, vendor: Oracle Corporation, runtime: C:\Program
Files\Java\jdk1.8.0_181\jre
Default locale: en_US, platform encoding: Cp1252
OS name: "windows 10", version: "10.0", arch: "amd64", family: "windows"

Running 'mvn clean test' OK using:

Apache Maven 3.5.4 (1edded0938998edf8bf061f1ceb3cfdeccf443fe;
2018-06-17T12:33:14-06:00)
Maven home: C:\Java\apache-maven-3.5.4\bin\..
Default locale: en_US, platform encoding: Cp1252
OS name: "windows 10", version: "10.0", arch: "amd64", family: "windows"

with:

Java version: 1.7.0_80, vendor: Oracle Corporation, runtime: C:\Program
Files\Java\jdk1.7.0_80\jre
Java version: 1.8.0_181, vendor: Oracle Corporation, runtime: C:\Program
Files\Java\jdk1.8.0_181\jre
Java version: 9.0.4, vendor: Oracle Corporation, runtime: C:\Program
Files\Java\jdk-9.0.4

Using:

Java version: 10.0.2, vendor: Oracle Corporation, runtime: C:\Program
Files\Java\jdk-10.0.2

Yields:

[INFO] -------------------------------------------------------
[INFO]  T E S T S
[INFO] -------------------------------------------------------
[WARNING] Corrupted STDOUT by directly writing to native stream in forked
JVM 1. See FAQ web page and the dump file
C:\temp\rc\commons-compress-1.18-src\target\surefire-reports\2018-08-13T12-22-16_818-jvmRun1.dumpstream
[INFO]
[INFO] Results:
[INFO]
[INFO] Tests run: 0, Failures: 0, Errors: 0, Skipped: 0
[INFO]
[INFO]
------------------------------------------------------------------------
[INFO] BUILD FAILURE
[INFO]
------------------------------------------------------------------------
[INFO] Total time: 24.079 s
[INFO] Finished at: 2018-08-13T12:22:17-06:00
[INFO]
------------------------------------------------------------------------
[ERROR] Failed to execute goal
org.apache.maven.plugins:maven-surefire-plugin:2.22.0:test (default-test)
on project commons-compress: There are test failures.
[ERROR]
[ERROR] Please refer to
C:\temp\rc\commons-compress-1.18-src\target\surefire-reports for the
individual test results.
[ERROR] Please refer to dump files (if any exist) [date]-jvmRun[N].dump,
[date].dumpstream and [date]-jvmRun[N].dumpstream.
[ERROR] The forked VM terminated without properly saying goodbye. VM crash
or System.exit called?
[ERROR] Command was cmd.exe /X /C ""C:\Program
Files\Java\jdk-10.0.2\bin\java"
-javaagent:C:\\Users\\ggregory\\.m2\\repository\\org\\jacoco\\org.jacoco.agent\\0.7.9\\org.jacoco.agent-0.7.9-runtime.jar=destfile=C:\\temp\\rc\\commons-compress-1.18-src\\target\\jacoco.exec
-jar
C:\Users\ggregory\AppData\Local\Temp\surefire7209161199370208887\surefirebooter6266538622956665978.jar
C:\Users\ggregory\AppData\Local\Temp\surefire7209161199370208887
2018-08-13T12-22-16_818-jvmRun1 surefire11827232589313839809tmp
surefire_02369712027571769119tmp"
[ERROR] Error occurred in starting fork, check output in log
[ERROR] Process Exit Code: 1
[ERROR] org.apache.maven.surefire.booter.SurefireBooterForkException: The
forked VM terminated without properly saying goodbye. VM crash or
System.exit called?
[ERROR] Command was cmd.exe /X /C ""C:\Program
Files\Java\jdk-10.0.2\bin\java"
-javaagent:C:\\Users\\ggregory\\.m2\\repository\\org\\jacoco\\org.jacoco.agent\\0.7.9\\org.jacoco.agent-0.7.9-runtime.jar=destfile=C:\\temp\\rc\\commons-compress-1.18-src\\target\\jacoco.exec
-jar
C:\Users\ggregory\AppData\Local\Temp\surefire7209161199370208887\surefirebooter6266538622956665978.jar
C:\Users\ggregory\AppData\Local\Temp\surefire7209161199370208887
2018-08-13T12-22-16_818-jvmRun1 surefire11827232589313839809tmp
surefire_02369712027571769119tmp"
[ERROR] Error occurred in starting fork, check output in log
[ERROR] Process Exit Code: 1
[ERROR]         at
org.apache.maven.plugin.surefire.booterclient.ForkStarter.fork(ForkStarter.java:671)
[ERROR]         at
org.apache.maven.plugin.surefire.booterclient.ForkStarter.fork(ForkStarter.java:533)
[ERROR]         at
org.apache.maven.plugin.surefire.booterclient.ForkStarter.run(ForkStarter.java:278)
[ERROR]         at
org.apache.maven.plugin.surefire.booterclient.ForkStarter.run(ForkStarter.java:244)
[ERROR]         at
org.apache.maven.plugin.surefire.AbstractSurefireMojo.executeProvider(AbstractSurefireMojo.java:1194)
[ERROR]         at
org.apache.maven.plugin.surefire.AbstractSurefireMojo.executeAfterPreconditionsChecked(AbstractSurefireMojo.java:1022)
[ERROR]         at
org.apache.maven.plugin.surefire.AbstractSurefireMojo.execute(AbstractSurefireMojo.java:868)
[ERROR]         at
org.apache.maven.plugin.DefaultBuildPluginManager.executeMojo(DefaultBuildPluginManager.java:137)
[ERROR]         at
org.apache.maven.lifecycle.internal.MojoExecutor.execute(MojoExecutor.java:208)
[ERROR]         at
org.apache.maven.lifecycle.internal.MojoExecutor.execute(MojoExecutor.java:154)
[ERROR]         at
org.apache.maven.lifecycle.internal.MojoExecutor.execute(MojoExecutor.java:146)
[ERROR]         at
org.apache.maven.lifecycle.internal.LifecycleModuleBuilder.buildProject(LifecycleModuleBuilder.java:117)
[ERROR]         at
org.apache.maven.lifecycle.internal.LifecycleModuleBuilder.buildProject(LifecycleModuleBuilder.java:81)
[ERROR]         at
org.apache.maven.lifecycle.internal.builder.singlethreaded.SingleThreadedBuilder.build(SingleThreadedBuilder.java:56)
[ERROR]         at
org.apache.maven.lifecycle.internal.LifecycleStarter.execute(LifecycleStarter.java:128)
[ERROR]         at
org.apache.maven.DefaultMaven.doExecute(DefaultMaven.java:305)
[ERROR]         at
org.apache.maven.DefaultMaven.doExecute(DefaultMaven.java:192)
[ERROR]         at
org.apache.maven.DefaultMaven.execute(DefaultMaven.java:105)
[ERROR]         at org.apache.maven.cli.MavenCli.execute(MavenCli.java:954)
[ERROR]         at org.apache.maven.cli.MavenCli.doMain(MavenCli.java:288)
[ERROR]         at org.apache.maven.cli.MavenCli.main(MavenCli.java:192)
[ERROR]         at
java.base/jdk.internal.reflect.NativeMethodAccessorImpl.invoke0(Native
Method)
[ERROR]         at
java.base/jdk.internal.reflect.NativeMethodAccessorImpl.invoke(NativeMethodAccessorImpl.java:62)
[ERROR]         at
java.base/jdk.internal.reflect.DelegatingMethodAccessorImpl.invoke(DelegatingMethodAccessorImpl.java:43)
[ERROR]         at
java.base/java.lang.reflect.Method.invoke(Method.java:564)
[ERROR]         at
org.codehaus.plexus.classworlds.launcher.Launcher.launchEnhanced(Launcher.java:289)
[ERROR]         at
org.codehaus.plexus.classworlds.launcher.Launcher.launch(Launcher.java:229)
[ERROR]         at
org.codehaus.plexus.classworlds.launcher.Launcher.mainWithExitCode(Launcher.java:415)
[ERROR]         at
org.codehaus.plexus.classworlds.launcher.Launcher.main(Launcher.java:356)
[ERROR]
[ERROR] -> [Help 1]
[ERROR]
[ERROR] To see the full stack trace of the errors, re-run Maven with the -e
switch.
[ERROR] Re-run Maven using the -X switch to enable full debug logging.
[ERROR]
[ERROR] For more information about the errors and possible solutions,
please read the following articles:
[ERROR] [Help 1]
http://cwiki.apache.org/confluence/display/MAVEN/MojoExecutionException

Using:

Java version: 11-ea, vendor: Oracle Corporation, runtime: C:\Program
Files\Java\jdk-11

Yields:

[WARNING] Corrupted STDOUT by directly writing to native stream in forked
JVM 1. See FAQ web page and the dump file
C:\temp\rc\commons-compress-1.18-src\target\surefire-reports\2018-08-13T12-22-58_446-jvmRun1.dumpstream
[INFO]
[INFO] Results:
[INFO]
[INFO] Tests run: 0, Failures: 0, Errors: 0, Skipped: 0
[INFO]
[INFO]
------------------------------------------------------------------------
[INFO] BUILD FAILURE
[INFO]
------------------------------------------------------------------------
[INFO] Total time: 28.353 s
[INFO] Finished at: 2018-08-13T12:22:59-06:00
[INFO]
------------------------------------------------------------------------
[ERROR] Failed to execute goal
org.apache.maven.plugins:maven-surefire-plugin:2.22.0:test (default-test)
on project commons-compress: There are test failures.
[ERROR]
[ERROR] Please refer to
C:\temp\rc\commons-compress-1.18-src\target\surefire-reports for the
individual test results.
[ERROR] Please refer to dump files (if any exist) [date]-jvmRun[N].dump,
[date].dumpstream and [date]-jvmRun[N].dumpstream.
[ERROR] The forked VM terminated without properly saying goodbye. VM crash
or System.exit called?
[ERROR] Command was cmd.exe /X /C ""C:\Program Files\Java\jdk-11\bin\java"
-javaagent:C:\\Users\\ggregory\\.m2\\repository\\org\\jacoco\\org.jacoco.agent\\0.7.9\\org.jacoco.agent-0.7.9-runtime.jar=destfile=C:\\temp\\rc\\commons-compress-1.18-src\\target\\jacoco.exec
-jar
C:\Users\ggregory\AppData\Local\Temp\surefire10152433741820882744\surefirebooter10168740296210520300.jar
C:\Users\ggregory\AppData\Local\Temp\surefire10152433741820882744
2018-08-13T12-22-58_446-jvmRun1 surefire5688114630607158967tmp
surefire_07256248504558504511tmp"
[ERROR] Error occurred in starting fork, check output in log
[ERROR] Process Exit Code: 1
[ERROR] org.apache.maven.surefire.booter.SurefireBooterForkException: The
forked VM terminated without properly saying goodbye. VM crash or
System.exit called?
[ERROR] Command was cmd.exe /X /C ""C:\Program Files\Java\jdk-11\bin\java"
-javaagent:C:\\Users\\ggregory\\.m2\\repository\\org\\jacoco\\org.jacoco.agent\\0.7.9\\org.jacoco.agent-0.7.9-runtime.jar=destfile=C:\\temp\\rc\\commons-compress-1.18-src\\target\\jacoco.exec
-jar
C:\Users\ggregory\AppData\Local\Temp\surefire10152433741820882744\surefirebooter10168740296210520300.jar
C:\Users\ggregory\AppData\Local\Temp\surefire10152433741820882744
2018-08-13T12-22-58_446-jvmRun1 surefire5688114630607158967tmp
surefire_07256248504558504511tmp"
[ERROR] Error occurred in starting fork, check output in log
[ERROR] Process Exit Code: 1
[ERROR]         at
org.apache.maven.plugin.surefire.booterclient.ForkStarter.fork(ForkStarter.java:671)
[ERROR]         at
org.apache.maven.plugin.surefire.booterclient.ForkStarter.fork(ForkStarter.java:533)
[ERROR]         at
org.apache.maven.plugin.surefire.booterclient.ForkStarter.run(ForkStarter.java:278)
[ERROR]         at
org.apache.maven.plugin.surefire.booterclient.ForkStarter.run(ForkStarter.java:244)
[ERROR]         at
org.apache.maven.plugin.surefire.AbstractSurefireMojo.executeProvider(AbstractSurefireMojo.java:1194)
[ERROR]         at
org.apache.maven.plugin.surefire.AbstractSurefireMojo.executeAfterPreconditionsChecked(AbstractSurefireMojo.java:1022)
[ERROR]         at
org.apache.maven.plugin.surefire.AbstractSurefireMojo.execute(AbstractSurefireMojo.java:868)
[ERROR]         at
org.apache.maven.plugin.DefaultBuildPluginManager.executeMojo(DefaultBuildPluginManager.java:137)
[ERROR]         at
org.apache.maven.lifecycle.internal.MojoExecutor.execute(MojoExecutor.java:208)
[ERROR]         at
org.apache.maven.lifecycle.internal.MojoExecutor.execute(MojoExecutor.java:154)
[ERROR]         at
org.apache.maven.lifecycle.internal.MojoExecutor.execute(MojoExecutor.java:146)
[ERROR]         at
org.apache.maven.lifecycle.internal.LifecycleModuleBuilder.buildProject(LifecycleModuleBuilder.java:117)
[ERROR]         at
org.apache.maven.lifecycle.internal.LifecycleModuleBuilder.buildProject(LifecycleModuleBuilder.java:81)
[ERROR]         at
org.apache.maven.lifecycle.internal.builder.singlethreaded.SingleThreadedBuilder.build(SingleThreadedBuilder.java:56)
[ERROR]         at
org.apache.maven.lifecycle.internal.LifecycleStarter.execute(LifecycleStarter.java:128)
[ERROR]         at
org.apache.maven.DefaultMaven.doExecute(DefaultMaven.java:305)
[ERROR]         at
org.apache.maven.DefaultMaven.doExecute(DefaultMaven.java:192)
[ERROR]         at
org.apache.maven.DefaultMaven.execute(DefaultMaven.java:105)
[ERROR]         at org.apache.maven.cli.MavenCli.execute(MavenCli.java:954)
[ERROR]         at org.apache.maven.cli.MavenCli.doMain(MavenCli.java:288)
[ERROR]         at org.apache.maven.cli.MavenCli.main(MavenCli.java:192)
[ERROR]         at
java.base/jdk.internal.reflect.NativeMethodAccessorImpl.invoke0(Native
Method)
[ERROR]         at
java.base/jdk.internal.reflect.NativeMethodAccessorImpl.invoke(NativeMethodAccessorImpl.java:62)
[ERROR]         at
java.base/jdk.internal.reflect.DelegatingMethodAccessorImpl.invoke(DelegatingMethodAccessorImpl.java:43)
[ERROR]         at
java.base/java.lang.reflect.Method.invoke(Method.java:566)
[ERROR]         at
org.codehaus.plexus.classworlds.launcher.Launcher.launchEnhanced(Launcher.java:289)
[ERROR]         at
org.codehaus.plexus.classworlds.launcher.Launcher.launch(Launcher.java:229)
[ERROR]         at
org.codehaus.plexus.classworlds.launcher.Launcher.mainWithExitCode(Launcher.java:415)
[ERROR]         at
org.codehaus.plexus.classworlds.launcher.Launcher.main(Launcher.java:356)
[ERROR]
[ERROR] -> [Help 1]
[ERROR]
[ERROR] To see the full stack trace of the errors, re-run Maven with the -e
switch.
[ERROR] Re-run Maven using the -X switch to enable full debug logging.
[ERROR]
[ERROR] For more information about the errors and possible solutions,
please read the following articles:
[ERROR] [Help 1]
http://cwiki.apache.org/confluence/display/MAVEN/MojoExecutionException

Using:

Java version: 12-ea, vendor: Oracle Corporation, runtime: C:\Program
Files\Java\jdk-12

Yields:

[WARNING] Corrupted STDOUT by directly writing to native stream in forked
JVM 1. See FAQ web page and the dump file
C:\temp\rc\commons-compress-1.18-src\target\surefire-reports\2018-08-13T12-23-49_099-jvmRun1.dumpstream
[INFO]
[INFO] Results:
[INFO]
[INFO] Tests run: 0, Failures: 0, Errors: 0, Skipped: 0
[INFO]
[INFO]
------------------------------------------------------------------------
[INFO] BUILD FAILURE
[INFO]
------------------------------------------------------------------------
[INFO] Total time: 29.052 s
[INFO] Finished at: 2018-08-13T12:23:50-06:00
[INFO]
------------------------------------------------------------------------
[ERROR] Failed to execute goal
org.apache.maven.plugins:maven-surefire-plugin:2.22.0:test (default-test)
on project commons-compress: There are test failures.
[ERROR]
[ERROR] Please refer to
C:\temp\rc\commons-compress-1.18-src\target\surefire-reports for the
individual test results.
[ERROR] Please refer to dump files (if any exist) [date]-jvmRun[N].dump,
[date].dumpstream and [date]-jvmRun[N].dumpstream.
[ERROR] The forked VM terminated without properly saying goodbye. VM crash
or System.exit called?
[ERROR] Command was cmd.exe /X /C ""C:\Program Files\Java\jdk-12\bin\java"
-javaagent:C:\\Users\\ggregory\\.m2\\repository\\org\\jacoco\\org.jacoco.agent\\0.7.9\\org.jacoco.agent-0.7.9-runtime.jar=destfile=C:\\temp\\rc\\commons-compress-1.18-src\\target\\jacoco.exec
-jar
C:\Users\ggregory\AppData\Local\Temp\surefire8301946583772802113\surefirebooter15881330005429776497.jar
C:\Users\ggregory\AppData\Local\Temp\surefire8301946583772802113
2018-08-13T12-23-49_099-jvmRun1 surefire14071758946483068675tmp
surefire_018368184688824352589tmp"
[ERROR] Error occurred in starting fork, check output in log
[ERROR] Process Exit Code: 1
[ERROR] org.apache.maven.surefire.booter.SurefireBooterForkException: The
forked VM terminated without properly saying goodbye. VM crash or
System.exit called?
[ERROR] Command was cmd.exe /X /C ""C:\Program Files\Java\jdk-12\bin\java"
-javaagent:C:\\Users\\ggregory\\.m2\\repository\\org\\jacoco\\org.jacoco.agent\\0.7.9\\org.jacoco.agent-0.7.9-runtime.jar=destfile=C:\\temp\\rc\\commons-compress-1.18-src\\target\\jacoco.exec
-jar
C:\Users\ggregory\AppData\Local\Temp\surefire8301946583772802113\surefirebooter15881330005429776497.jar
C:\Users\ggregory\AppData\Local\Temp\surefire8301946583772802113
2018-08-13T12-23-49_099-jvmRun1 surefire14071758946483068675tmp
surefire_018368184688824352589tmp"
[ERROR] Error occurred in starting fork, check output in log
[ERROR] Process Exit Code: 1
[ERROR]         at
org.apache.maven.plugin.surefire.booterclient.ForkStarter.fork(ForkStarter.java:671)
[ERROR]         at
org.apache.maven.plugin.surefire.booterclient.ForkStarter.fork(ForkStarter.java:533)
[ERROR]         at
org.apache.maven.plugin.surefire.booterclient.ForkStarter.run(ForkStarter.java:278)
[ERROR]         at
org.apache.maven.plugin.surefire.booterclient.ForkStarter.run(ForkStarter.java:244)
[ERROR]         at
org.apache.maven.plugin.surefire.AbstractSurefireMojo.executeProvider(AbstractSurefireMojo.java:1194)
[ERROR]         at
org.apache.maven.plugin.surefire.AbstractSurefireMojo.executeAfterPreconditionsChecked(AbstractSurefireMojo.java:1022)
[ERROR]         at
org.apache.maven.plugin.surefire.AbstractSurefireMojo.execute(AbstractSurefireMojo.java:868)
[ERROR]         at
org.apache.maven.plugin.DefaultBuildPluginManager.executeMojo(DefaultBuildPluginManager.java:137)
[ERROR]         at
org.apache.maven.lifecycle.internal.MojoExecutor.execute(MojoExecutor.java:208)
[ERROR]         at
org.apache.maven.lifecycle.internal.MojoExecutor.execute(MojoExecutor.java:154)
[ERROR]         at
org.apache.maven.lifecycle.internal.MojoExecutor.execute(MojoExecutor.java:146)
[ERROR]         at
org.apache.maven.lifecycle.internal.LifecycleModuleBuilder.buildProject(LifecycleModuleBuilder.java:117)
[ERROR]         at
org.apache.maven.lifecycle.internal.LifecycleModuleBuilder.buildProject(LifecycleModuleBuilder.java:81)
[ERROR]         at
org.apache.maven.lifecycle.internal.builder.singlethreaded.SingleThreadedBuilder.build(SingleThreadedBuilder.java:56)
[ERROR]         at
org.apache.maven.lifecycle.internal.LifecycleStarter.execute(LifecycleStarter.java:128)
[ERROR]         at
org.apache.maven.DefaultMaven.doExecute(DefaultMaven.java:305)
[ERROR]         at
org.apache.maven.DefaultMaven.doExecute(DefaultMaven.java:192)
[ERROR]         at
org.apache.maven.DefaultMaven.execute(DefaultMaven.java:105)
[ERROR]         at org.apache.maven.cli.MavenCli.execute(MavenCli.java:954)
[ERROR]         at org.apache.maven.cli.MavenCli.doMain(MavenCli.java:288)
[ERROR]         at org.apache.maven.cli.MavenCli.main(MavenCli.java:192)
[ERROR]         at
java.base/jdk.internal.reflect.NativeMethodAccessorImpl.invoke0(Native
Method)
[ERROR]         at
java.base/jdk.internal.reflect.NativeMethodAccessorImpl.invoke(NativeMethodAccessorImpl.java:62)
[ERROR]         at
java.base/jdk.internal.reflect.DelegatingMethodAccessorImpl.invoke(DelegatingMethodAccessorImpl.java:43)
[ERROR]         at
java.base/java.lang.reflect.Method.invoke(Method.java:566)
[ERROR]         at
org.codehaus.plexus.classworlds.launcher.Launcher.launchEnhanced(Launcher.java:289)
[ERROR]         at
org.codehaus.plexus.classworlds.launcher.Launcher.launch(Launcher.java:229)
[ERROR]         at
org.codehaus.plexus.classworlds.launcher.Launcher.mainWithExitCode(Launcher.java:415)
[ERROR]         at
org.codehaus.plexus.classworlds.launcher.Launcher.main(Launcher.java:356)
[ERROR]
[ERROR] -> [Help 1]
[ERROR]
[ERROR] To see the full stack trace of the errors, re-run Maven with the -e
switch.
[ERROR] Re-run Maven using the -X switch to enable full debug logging.
[ERROR]
[ERROR] For more information about the errors and possible solutions,
please read the following articles:
[ERROR] [Help 1]
http://cwiki.apache.org/confluence/display/MAVEN/MojoExecutionException

Gary

On Mon, Aug 13, 2018 at 1:44 AM Stefan Bodewig <[hidden email]> wrote:

> Hi all,
>
> I would like to release Compress 1.18.
>
> Compress 1.18 RC1 is available for review here:
>     https://dist.apache.org/repos/dist/dev/commons/compress/ (svn
> revision 28684)
>
> The tag is here:
>     tag 1.18-RC1 on commit b95d5cde
>
> https://git-wip-us.apache.org/repos/asf?p=commons-compress.git;a=commit;h=b95d5cde4c68640f886e3c6802384fae47408a37
>
> Maven artifacts are here:
>
> https://repository.apache.org/content/repositories/orgapachecommons-1367/org/apache/commons/commons-compress/1.18/
>
> These are the Maven artifacts and their SHA256 hashes
>
> 5f2df1e467825e4cac5996d44890c4201c000b43c0b23cffc0782d28a0beb9b0
> commons-compress-1.18.jar
> 23b382156431d6350745c571e533fabe28aebe8da1de6e039e8e480bb9764dfc
> commons-compress-1.18-javadoc.jar
> c8e6896eb3d3880ffc21bb93d563b7cc0d3e2152c8181f261a748502290a5947
> commons-compress-1.18-sources.jar
> 630a8c16d58d2d7475c82a98b032390831d22589bccd0f9086e95e85742a41b3
> commons-compress-1.18-tests.jar
> ea06230ae8f1ef954da571d3bb13c2324fee703d7cfee2699a76d3793b531cec
> commons-compress-1.18-test-sources.jar
> 672c5fe92bd3eab43e8d53338cad5ca073b6529de4eb2b38859a3eaa6c9e8119
> commons-compress-1.18.pom
>
> I have tested this with JDK 8 using Maven 3.5.4.
>
> Details of changes since 1.17 are in the release notes:
>
> https://dist.apache.org/repos/dist/dev/commons/compress/RELEASE-NOTES.txt
>
> https://stefan.samaflost.de/staging/commons-compress-1.18/changes-report.html
>
> Site:
>     https://stefan.samaflost.de/staging/commons-compress-1.18/
>
>     as usual this is not the site I'm going to publish after the
>     release, I'll re-create the site when the release date is
>     clear. The download link and 1.18 javadoc link won't work right
>     now.
>
> japicmp Report (compared to 1.17):
>     https://stefan.samaflost.de/staging/commons-compress-1.18/japicmp.html
>
> RAT Report:
>
> https://stefan.samaflost.de/staging/commons-compress-1.18/rat-report.html
>
> KEYS:
>   https://www.apache.org/dist/commons/KEYS
>
> Please review the release candidate and vote.
> This vote will close no sooner that 72 hours from now,
> i.e. sometime after 08:00 UTC 16-August 2018
>
>   [ ] +1 Release these artifacts
>   [ ] +0 OK, but...
>   [ ] -0 OK, but really should fix...
>   [ ] -1 I oppose this release because...
>
> Thanks!
>
>         Stefan
>
> ---------------------------------------------------------------------
> To unsubscribe, e-mail: [hidden email]
> For additional commands, e-mail: [hidden email]
>
>
Reply | Threaded
Open this post in threaded view
|

Re: [External Sender] Re: [VOTE] Release Compress 1.18 based on RC1

Tompkins, Rob
I'll get to this in the morning. I'm currently dealing with a PICNIC at work.

Rob Tompkins
804.241.3104
[hidden email]
[hidden email]

On 8/13/18, 2:24 PM, "Gary Gregory" <[hidden email]> wrote:

    +1
   
    From src zip: ASC, SHA256 OK.
    In the future we should only publish SHA512 hashes.
   
    Site typo: "It is no possible to specifiy various parameters for Zstd
    output."
    -> "It is *now *possible to *specify *various parameters for Zstd output."
   
    changes.xml needs a release date (I usually try to remember to do this as
    part of the RC.)
   
    mvn clean package site OK
    mvn apache-rat:check OK
    mvn clirr:check OK
    mvn clean install -DskipTests japicmp:cmp OK writing
    C:\temp\rc\commons-compress-1.18-src\target\japicmp\default-cli.html OK
   
    What does this mean:
   
    [INFO] Skipping JaCoCo execution due to missing execution data file.
    Aug 13, 2018 12:05:21 PM
    net.sourceforge.pmd.lang.java.typeresolution.ClassTypeResolver visit
    WARNING: Could not find class
    org.apache.commons.compress.archivers.sevenz.LZMADecoder, due to:
    java.lang.IllegalAccessError: class
    org.apache.commons.compress.archivers.sevenz.LZMADecoder cannot access its
    superclass org.apache.commons.compress.archivers.sevenz.CoderBase
   
    ?
   
    Nit:
   
    [INFO] --- maven-compiler-plugin:3.7.0:compile (default-compile) @
    commons-compress ---
    [INFO] Changes detected - recompiling the module!
    [INFO] Compiling 206 source files to
    C:\temp\rc\commons-compress-1.18-src\target\classes
    [INFO]
    /C:/temp/rc/commons-compress-1.18-src/src/main/java/org/apache/commons/compress/utils/Sets.java:
    C:\temp\rc\commons-compress-1.18-src\src\main\java\org\apache\commons\compress\utils\Sets.java
    uses unchecked or unsafe operations.
    [INFO]
    /C:/temp/rc/commons-compress-1.18-src/src/main/java/org/apache/commons/compress/utils/Sets.java:
    Recompile with -Xlint:unchecked for details.
   
    Too bad we get multiple instances of ProjectBuildingException:
   
    [INFO] <<< jdepend-maven-plugin:2.0:generate < compile @ commons-compress
    <<<
    [INFO]
    [INFO] 'compile' forked phase execution for jdepend-maven-plugin:generate
    report preparation done
    [INFO] 2 reports detected for jdepend-maven-plugin:2.0: generate-no-fork,
    generate
    [INFO] configuring report plugin
    com.github.siom79.japicmp:japicmp-maven-plugin:0.11.1
    [INFO] 1 report detected for japicmp-maven-plugin:0.11.1: cmp-report
    [INFO] configuring report plugin org.jacoco:jacoco-maven-plugin:0.8.1
    [INFO] 3 reports detected for jacoco-maven-plugin:0.8.1: report,
    report-aggregate, report-integration
    [INFO] configuring report plugin
    org.apache.maven.plugins:maven-pmd-plugin:3.8
    [INFO] 2 reports detected for maven-pmd-plugin:3.8: cpd, pmd
    [INFO] configuring report plugin
    org.codehaus.mojo:findbugs-maven-plugin:3.0.5
    [INFO] 1 report detected for findbugs-maven-plugin:3.0.5: findbugs
    [INFO] Skipping JaCoCo execution due to missing execution data file.
    Aug 13, 2018 12:11:59 PM
    net.sourceforge.pmd.lang.java.typeresolution.ClassTypeResolver visit
    WARNING: Could not find class
    org.apache.commons.compress.archivers.sevenz.LZMADecoder, due to:
    java.lang.IllegalAccessError: class
    org.apache.commons.compress.archivers.sevenz.LZMADecoder cannot access its
    superclass org.apache.commons.compress.archivers.sevenz.CoderBase
    [INFO] Fork Value is true
    [INFO] Done FindBugs Analysis....
    [INFO] Rendering site with default locale English (en)
    [INFO] Relativizing decoration links with respect to localized project URL:
    https://urldefense.proofpoint.com/v2/url?u=https-3A__commons.apache.org_proper_commons-2Dcompress_&d=DwIBaQ&c=pLULRYW__RtkwsQUPxJVDGboCTdgji3AcHNJU0BpTJE&r=27OVbTucXn2Bx5CgcyvZLDGrgMPAZgw_bo5aZUpYvprB8wXKlJvJ4ctwSQZcwAnA1zGfkAXdjakcRBcfCJ_XCQ&m=xLDlZE0TY7cPqwoYXuQoB9gi-LqWN1OcFIoE6tNu49Q&s=TgLvhrFOevxla63cKxFKX1G0B4eZNV-BzJIHY08O76s&e=
    [INFO] Rendering content with org.apache.commons:commons-skin:jar:4.1 skin.
    [INFO] Skipped "About" report
    (maven-project-info-reports-plugin:3.0.0:index), file "index.html" already
    exists.
    [INFO] Skipped "Surefire Report" report
    (maven-surefire-report-plugin:2.22.0:report-only), file
    "surefire-report.html" already exists.
    [INFO] Skipped "JDepend" report (jdepend-maven-plugin:2.0:generate), file
    "jdepend-report.html" already exists.
    [INFO] Rendering 11 Doxia documents: 11 xdoc
    [WARNING] [XHTML Sink] No HTML tag found for unknown event: 'codee',
    ignoring!
    [INFO] Generating "Changes" report       ---
    maven-changes-plugin:2.12.1:changes-report
    [INFO] Generating "JIRA Report" report   ---
    maven-changes-plugin:2.12.1:jira-report
    [INFO] The JIRA Report will contain issues only for the current version.
    [INFO] Generating "Javadoc" report       ---
    maven-javadoc-plugin:3.0.1:javadoc
    [INFO] Generating "Source Xref" report   --- maven-jxr-plugin:2.5:jxr
    [INFO] Generating "Test Source Xref" report ---
    maven-jxr-plugin:2.5:test-jxr
    [INFO] Generating "Summary" report       ---
    maven-project-info-reports-plugin:3.0.0:summary
    [INFO] Generating "Team" report          ---
    maven-project-info-reports-plugin:3.0.0:team
    [INFO] Generating "Source Code Management" report ---
    maven-project-info-reports-plugin:3.0.0:scm
    [INFO] Generating "Issue Management" report ---
    maven-project-info-reports-plugin:3.0.0:issue-management
    [INFO] Generating "Mailing Lists" report ---
    maven-project-info-reports-plugin:3.0.0:mailing-lists
    [INFO] Generating "Dependency Information" report ---
    maven-project-info-reports-plugin:3.0.0:dependency-info
    [INFO] Generating "Dependencies" report  ---
    maven-project-info-reports-plugin:3.0.0:dependencies
    [WARNING] Unable to create Maven project from repository.
    org.apache.maven.project.ProjectBuildingException: Some problems were
    encountered while processing the POMs:
    [ERROR] Unknown packaging: bundle @ line 6, column 16
   
        at org.apache.maven.project.DefaultProjectBuilder.build
    (DefaultProjectBuilder.java:192)
        at org.apache.maven.project.DefaultProjectBuilder.build
    (DefaultProjectBuilder.java:327)
        at
    org.apache.maven.report.projectinfo.dependencies.RepositoryUtils.getMavenProjectFromRepository
    (RepositoryUtils.java:125)
        at
    org.apache.maven.report.projectinfo.dependencies.renderer.DependenciesRenderer.renderArtifactRow
    (DependenciesRenderer.java:799)
        at
    org.apache.maven.report.projectinfo.dependencies.renderer.DependenciesRenderer.renderDependenciesForScope
    (DependenciesRenderer.java:749)
        at
    org.apache.maven.report.projectinfo.dependencies.renderer.DependenciesRenderer.renderDependenciesForAllScopes
    (DependenciesRenderer.java:413)
        at
    org.apache.maven.report.projectinfo.dependencies.renderer.DependenciesRenderer.renderSectionProjectDependencies
    (DependenciesRenderer.java:397)
        at
    org.apache.maven.report.projectinfo.dependencies.renderer.DependenciesRenderer.renderBody
    (DependenciesRenderer.java:216)
        at org.apache.maven.reporting.AbstractMavenReportRenderer.render
    (AbstractMavenReportRenderer.java:80)
        at org.apache.maven.report.projectinfo.DependenciesReport.executeReport
    (DependenciesReport.java:162)
        at org.apache.maven.reporting.AbstractMavenReport.generate
    (AbstractMavenReport.java:251)
        at
    org.apache.maven.plugins.site.render.ReportDocumentRenderer.renderDocument
    (ReportDocumentRenderer.java:230)
        at org.apache.maven.doxia.siterenderer.DefaultSiteRenderer.render
    (DefaultSiteRenderer.java:349)
        at org.apache.maven.plugins.site.render.SiteMojo.renderLocale
    (SiteMojo.java:198)
        at org.apache.maven.plugins.site.render.SiteMojo.execute
    (SiteMojo.java:147)
        at org.apache.maven.plugin.DefaultBuildPluginManager.executeMojo
    (DefaultBuildPluginManager.java:137)
        at org.apache.maven.lifecycle.internal.MojoExecutor.execute
    (MojoExecutor.java:208)
        at org.apache.maven.lifecycle.internal.MojoExecutor.execute
    (MojoExecutor.java:154)
        at org.apache.maven.lifecycle.internal.MojoExecutor.execute
    (MojoExecutor.java:146)
        at
    org.apache.maven.lifecycle.internal.LifecycleModuleBuilder.buildProject
    (LifecycleModuleBuilder.java:117)
        at
    org.apache.maven.lifecycle.internal.LifecycleModuleBuilder.buildProject
    (LifecycleModuleBuilder.java:81)
        at
    org.apache.maven.lifecycle.internal.builder.singlethreaded.SingleThreadedBuilder.build
    (SingleThreadedBuilder.java:56)
        at org.apache.maven.lifecycle.internal.LifecycleStarter.execute
    (LifecycleStarter.java:128)
        at org.apache.maven.DefaultMaven.doExecute (DefaultMaven.java:305)
        at org.apache.maven.DefaultMaven.doExecute (DefaultMaven.java:192)
        at org.apache.maven.DefaultMaven.execute (DefaultMaven.java:105)
        at org.apache.maven.cli.MavenCli.execute (MavenCli.java:954)
        at org.apache.maven.cli.MavenCli.doMain (MavenCli.java:288)
        at org.apache.maven.cli.MavenCli.main (MavenCli.java:192)
        at sun.reflect.NativeMethodAccessorImpl.invoke0 (Native Method)
        at sun.reflect.NativeMethodAccessorImpl.invoke
    (NativeMethodAccessorImpl.java:62)
        at sun.reflect.DelegatingMethodAccessorImpl.invoke
    (DelegatingMethodAccessorImpl.java:43)
        at java.lang.reflect.Method.invoke (Method.java:498)
        at org.codehaus.plexus.classworlds.launcher.Launcher.launchEnhanced
    (Launcher.java:289)
        at org.codehaus.plexus.classworlds.launcher.Launcher.launch
    (Launcher.java:229)
        at org.codehaus.plexus.classworlds.launcher.Launcher.mainWithExitCode
    (Launcher.java:415)
        at org.codehaus.plexus.classworlds.launcher.Launcher.main
    (Launcher.java:356)
    Caused by: org.apache.maven.model.building.ModelBuildingException: 1
    problem was encountered while building the effective model for
    com.github.luben:zstd-jni:1.3.3-3
    [ERROR] Unknown packaging: bundle @ line 6, column 16
   
        at
    org.apache.maven.model.building.DefaultModelProblemCollector.newModelBuildingException
    (DefaultModelProblemCollector.java:197)
        at org.apache.maven.model.building.DefaultModelBuilder.build
    (DefaultModelBuilder.java:482)
        at org.apache.maven.model.building.DefaultModelBuilder.build
    (DefaultModelBuilder.java:424)
        at org.apache.maven.model.building.DefaultModelBuilder.build
    (DefaultModelBuilder.java:414)
        at org.apache.maven.project.DefaultProjectBuilder.build
    (DefaultProjectBuilder.java:158)
        at org.apache.maven.project.DefaultProjectBuilder.build
    (DefaultProjectBuilder.java:327)
        at
    org.apache.maven.report.projectinfo.dependencies.RepositoryUtils.getMavenProjectFromRepository
    (RepositoryUtils.java:125)
        at
    org.apache.maven.report.projectinfo.dependencies.renderer.DependenciesRenderer.renderArtifactRow
    (DependenciesRenderer.java:799)
        at
    org.apache.maven.report.projectinfo.dependencies.renderer.DependenciesRenderer.renderDependenciesForScope
    (DependenciesRenderer.java:749)
        at
    org.apache.maven.report.projectinfo.dependencies.renderer.DependenciesRenderer.renderDependenciesForAllScopes
    (DependenciesRenderer.java:413)
        at
    org.apache.maven.report.projectinfo.dependencies.renderer.DependenciesRenderer.renderSectionProjectDependencies
    (DependenciesRenderer.java:397)
        at
    org.apache.maven.report.projectinfo.dependencies.renderer.DependenciesRenderer.renderBody
    (DependenciesRenderer.java:216)
        at org.apache.maven.reporting.AbstractMavenReportRenderer.render
    (AbstractMavenReportRenderer.java:80)
        at org.apache.maven.report.projectinfo.DependenciesReport.executeReport
    (DependenciesReport.java:162)
        at org.apache.maven.reporting.AbstractMavenReport.generate
    (AbstractMavenReport.java:251)
        at
    org.apache.maven.plugins.site.render.ReportDocumentRenderer.renderDocument
    (ReportDocumentRenderer.java:230)
        at org.apache.maven.doxia.siterenderer.DefaultSiteRenderer.render
    (DefaultSiteRenderer.java:349)
        at org.apache.maven.plugins.site.render.SiteMojo.renderLocale
    (SiteMojo.java:198)
        at org.apache.maven.plugins.site.render.SiteMojo.execute
    (SiteMojo.java:147)
        at org.apache.maven.plugin.DefaultBuildPluginManager.executeMojo
    (DefaultBuildPluginManager.java:137)
        at org.apache.maven.lifecycle.internal.MojoExecutor.execute
    (MojoExecutor.java:208)
        at org.apache.maven.lifecycle.internal.MojoExecutor.execute
    (MojoExecutor.java:154)
        at org.apache.maven.lifecycle.internal.MojoExecutor.execute
    (MojoExecutor.java:146)
        at
    org.apache.maven.lifecycle.internal.LifecycleModuleBuilder.buildProject
    (LifecycleModuleBuilder.java:117)
        at
    org.apache.maven.lifecycle.internal.LifecycleModuleBuilder.buildProject
    (LifecycleModuleBuilder.java:81)
        at
    org.apache.maven.lifecycle.internal.builder.singlethreaded.SingleThreadedBuilder.build
    (SingleThreadedBuilder.java:56)
        at org.apache.maven.lifecycle.internal.LifecycleStarter.execute
    (LifecycleStarter.java:128)
        at org.apache.maven.DefaultMaven.doExecute (DefaultMaven.java:305)
        at org.apache.maven.DefaultMaven.doExecute (DefaultMaven.java:192)
        at org.apache.maven.DefaultMaven.execute (DefaultMaven.java:105)
        at org.apache.maven.cli.MavenCli.execute (MavenCli.java:954)
        at org.apache.maven.cli.MavenCli.doMain (MavenCli.java:288)
        at org.apache.maven.cli.MavenCli.main (MavenCli.java:192)
        at sun.reflect.NativeMethodAccessorImpl.invoke0 (Native Method)
        at sun.reflect.NativeMethodAccessorImpl.invoke
    (NativeMethodAccessorImpl.java:62)
        at sun.reflect.DelegatingMethodAccessorImpl.invoke
    (DelegatingMethodAccessorImpl.java:43)
        at java.lang.reflect.Method.invoke (Method.java:498)
        at org.codehaus.plexus.classworlds.launcher.Launcher.launchEnhanced
    (Launcher.java:289)
        at org.codehaus.plexus.classworlds.launcher.Launcher.launch
    (Launcher.java:229)
        at org.codehaus.plexus.classworlds.launcher.Launcher.mainWithExitCode
    (Launcher.java:415)
        at org.codehaus.plexus.classworlds.launcher.Launcher.main
    (Launcher.java:356)
    [WARNING] Unable to create Maven project from repository for artifact
    com.github.luben:zstd-jni:jar:1.3.3-3
    org.apache.maven.project.ProjectBuildingException: Some problems were
    encountered while processing the POMs:
    [ERROR] Unknown packaging: bundle @ line 6, column 16
   
        at org.apache.maven.project.DefaultProjectBuilder.build
    (DefaultProjectBuilder.java:192)
        at org.apache.maven.project.DefaultProjectBuilder.build
    (DefaultProjectBuilder.java:327)
        at
    org.apache.maven.report.projectinfo.dependencies.RepositoryUtils.getMavenProjectFromRepository
    (RepositoryUtils.java:125)
        at
    org.apache.maven.report.projectinfo.dependencies.renderer.DependenciesRenderer.printDescriptionsAndURLs
    (DependenciesRenderer.java:890)
        at
    org.apache.maven.report.projectinfo.dependencies.renderer.DependenciesRenderer.printDependencyListing
    (DependenciesRenderer.java:847)
        at
    org.apache.maven.report.projectinfo.dependencies.renderer.DependenciesRenderer.printDependencyListing
    (DependenciesRenderer.java:867)
        at
    org.apache.maven.report.projectinfo.dependencies.renderer.DependenciesRenderer.renderSectionDependencyTree
    (DependenciesRenderer.java:486)
        at
    org.apache.maven.report.projectinfo.dependencies.renderer.DependenciesRenderer.renderSectionProjectDependencyGraph
    (DependenciesRenderer.java:449)
        at
    org.apache.maven.report.projectinfo.dependencies.renderer.DependenciesRenderer.renderBody
    (DependenciesRenderer.java:222)
        at org.apache.maven.reporting.AbstractMavenReportRenderer.render
    (AbstractMavenReportRenderer.java:80)
        at org.apache.maven.report.projectinfo.DependenciesReport.executeReport
    (DependenciesReport.java:162)
        at org.apache.maven.reporting.AbstractMavenReport.generate
    (AbstractMavenReport.java:251)
        at
    org.apache.maven.plugins.site.render.ReportDocumentRenderer.renderDocument
    (ReportDocumentRenderer.java:230)
        at org.apache.maven.doxia.siterenderer.DefaultSiteRenderer.render
    (DefaultSiteRenderer.java:349)
        at org.apache.maven.plugins.site.render.SiteMojo.renderLocale
    (SiteMojo.java:198)
        at org.apache.maven.plugins.site.render.SiteMojo.execute
    (SiteMojo.java:147)
        at org.apache.maven.plugin.DefaultBuildPluginManager.executeMojo
    (DefaultBuildPluginManager.java:137)
        at org.apache.maven.lifecycle.internal.MojoExecutor.execute
    (MojoExecutor.java:208)
        at org.apache.maven.lifecycle.internal.MojoExecutor.execute
    (MojoExecutor.java:154)
        at org.apache.maven.lifecycle.internal.MojoExecutor.execute
    (MojoExecutor.java:146)
        at
    org.apache.maven.lifecycle.internal.LifecycleModuleBuilder.buildProject
    (LifecycleModuleBuilder.java:117)
        at
    org.apache.maven.lifecycle.internal.LifecycleModuleBuilder.buildProject
    (LifecycleModuleBuilder.java:81)
        at
    org.apache.maven.lifecycle.internal.builder.singlethreaded.SingleThreadedBuilder.build
    (SingleThreadedBuilder.java:56)
        at org.apache.maven.lifecycle.internal.LifecycleStarter.execute
    (LifecycleStarter.java:128)
        at org.apache.maven.DefaultMaven.doExecute (DefaultMaven.java:305)
        at org.apache.maven.DefaultMaven.doExecute (DefaultMaven.java:192)
        at org.apache.maven.DefaultMaven.execute (DefaultMaven.java:105)
        at org.apache.maven.cli.MavenCli.execute (MavenCli.java:954)
        at org.apache.maven.cli.MavenCli.doMain (MavenCli.java:288)
        at org.apache.maven.cli.MavenCli.main (MavenCli.java:192)
        at sun.reflect.NativeMethodAccessorImpl.invoke0 (Native Method)
        at sun.reflect.NativeMethodAccessorImpl.invoke
    (NativeMethodAccessorImpl.java:62)
        at sun.reflect.DelegatingMethodAccessorImpl.invoke
    (DelegatingMethodAccessorImpl.java:43)
        at java.lang.reflect.Method.invoke (Method.java:498)
        at org.codehaus.plexus.classworlds.launcher.Launcher.launchEnhanced
    (Launcher.java:289)
        at org.codehaus.plexus.classworlds.launcher.Launcher.launch
    (Launcher.java:229)
        at org.codehaus.plexus.classworlds.launcher.Launcher.mainWithExitCode
    (Launcher.java:415)
        at org.codehaus.plexus.classworlds.launcher.Launcher.main
    (Launcher.java:356)
    Caused by: org.apache.maven.model.building.ModelBuildingException: 1
    problem was encountered while building the effective model for
    com.github.luben:zstd-jni:1.3.3-3
    [ERROR] Unknown packaging: bundle @ line 6, column 16
   
        at
    org.apache.maven.model.building.DefaultModelProblemCollector.newModelBuildingException
    (DefaultModelProblemCollector.java:197)
        at org.apache.maven.model.building.DefaultModelBuilder.build
    (DefaultModelBuilder.java:482)
        at org.apache.maven.model.building.DefaultModelBuilder.build
    (DefaultModelBuilder.java:424)
        at org.apache.maven.model.building.DefaultModelBuilder.build
    (DefaultModelBuilder.java:414)
        at org.apache.maven.project.DefaultProjectBuilder.build
    (DefaultProjectBuilder.java:158)
        at org.apache.maven.project.DefaultProjectBuilder.build
    (DefaultProjectBuilder.java:327)
        at
    org.apache.maven.report.projectinfo.dependencies.RepositoryUtils.getMavenProjectFromRepository
    (RepositoryUtils.java:125)
        at
    org.apache.maven.report.projectinfo.dependencies.renderer.DependenciesRenderer.printDescriptionsAndURLs
    (DependenciesRenderer.java:890)
        at
    org.apache.maven.report.projectinfo.dependencies.renderer.DependenciesRenderer.printDependencyListing
    (DependenciesRenderer.java:847)
        at
    org.apache.maven.report.projectinfo.dependencies.renderer.DependenciesRenderer.printDependencyListing
    (DependenciesRenderer.java:867)
        at
    org.apache.maven.report.projectinfo.dependencies.renderer.DependenciesRenderer.renderSectionDependencyTree
    (DependenciesRenderer.java:486)
        at
    org.apache.maven.report.projectinfo.dependencies.renderer.DependenciesRenderer.renderSectionProjectDependencyGraph
    (DependenciesRenderer.java:449)
        at
    org.apache.maven.report.projectinfo.dependencies.renderer.DependenciesRenderer.renderBody
    (DependenciesRenderer.java:222)
        at org.apache.maven.reporting.AbstractMavenReportRenderer.render
    (AbstractMavenReportRenderer.java:80)
        at org.apache.maven.report.projectinfo.DependenciesReport.executeReport
    (DependenciesReport.java:162)
        at org.apache.maven.reporting.AbstractMavenReport.generate
    (AbstractMavenReport.java:251)
        at
    org.apache.maven.plugins.site.render.ReportDocumentRenderer.renderDocument
    (ReportDocumentRenderer.java:230)
        at org.apache.maven.doxia.siterenderer.DefaultSiteRenderer.render
    (DefaultSiteRenderer.java:349)
        at org.apache.maven.plugins.site.render.SiteMojo.renderLocale
    (SiteMojo.java:198)
        at org.apache.maven.plugins.site.render.SiteMojo.execute
    (SiteMojo.java:147)
        at org.apache.maven.plugin.DefaultBuildPluginManager.executeMojo
    (DefaultBuildPluginManager.java:137)
        at org.apache.maven.lifecycle.internal.MojoExecutor.execute
    (MojoExecutor.java:208)
        at org.apache.maven.lifecycle.internal.MojoExecutor.execute
    (MojoExecutor.java:154)
        at org.apache.maven.lifecycle.internal.MojoExecutor.execute
    (MojoExecutor.java:146)
        at
    org.apache.maven.lifecycle.internal.LifecycleModuleBuilder.buildProject
    (LifecycleModuleBuilder.java:117)
        at
    org.apache.maven.lifecycle.internal.LifecycleModuleBuilder.buildProject
    (LifecycleModuleBuilder.java:81)
        at
    org.apache.maven.lifecycle.internal.builder.singlethreaded.SingleThreadedBuilder.build
    (SingleThreadedBuilder.java:56)
        at org.apache.maven.lifecycle.internal.LifecycleStarter.execute
    (LifecycleStarter.java:128)
        at org.apache.maven.DefaultMaven.doExecute (DefaultMaven.java:305)
        at org.apache.maven.DefaultMaven.doExecute (DefaultMaven.java:192)
        at org.apache.maven.DefaultMaven.execute (DefaultMaven.java:105)
        at org.apache.maven.cli.MavenCli.execute (MavenCli.java:954)
        at org.apache.maven.cli.MavenCli.doMain (MavenCli.java:288)
        at org.apache.maven.cli.MavenCli.main (MavenCli.java:192)
        at sun.reflect.NativeMethodAccessorImpl.invoke0 (Native Method)
        at sun.reflect.NativeMethodAccessorImpl.invoke
    (NativeMethodAccessorImpl.java:62)
        at sun.reflect.DelegatingMethodAccessorImpl.invoke
    (DelegatingMethodAccessorImpl.java:43)
        at java.lang.reflect.Method.invoke (Method.java:498)
        at org.codehaus.plexus.classworlds.launcher.Launcher.launchEnhanced
    (Launcher.java:289)
        at org.codehaus.plexus.classworlds.launcher.Launcher.launch
    (Launcher.java:229)
        at org.codehaus.plexus.classworlds.launcher.Launcher.mainWithExitCode
    (Launcher.java:415)
        at org.codehaus.plexus.classworlds.launcher.Launcher.main
    (Launcher.java:356)
   
    Using 'mvn clean package site' with:
   
    Apache Maven 3.5.4 (1edded0938998edf8bf061f1ceb3cfdeccf443fe;
    2018-06-17T12:33:14-06:00)
    Maven home: C:\Java\apache-maven-3.5.4\bin\..
    Java version: 1.8.0_181, vendor: Oracle Corporation, runtime: C:\Program
    Files\Java\jdk1.8.0_181\jre
    Default locale: en_US, platform encoding: Cp1252
    OS name: "windows 10", version: "10.0", arch: "amd64", family: "windows"
   
    Running 'mvn clean test' OK using:
   
    Apache Maven 3.5.4 (1edded0938998edf8bf061f1ceb3cfdeccf443fe;
    2018-06-17T12:33:14-06:00)
    Maven home: C:\Java\apache-maven-3.5.4\bin\..
    Default locale: en_US, platform encoding: Cp1252
    OS name: "windows 10", version: "10.0", arch: "amd64", family: "windows"
   
    with:
   
    Java version: 1.7.0_80, vendor: Oracle Corporation, runtime: C:\Program
    Files\Java\jdk1.7.0_80\jre
    Java version: 1.8.0_181, vendor: Oracle Corporation, runtime: C:\Program
    Files\Java\jdk1.8.0_181\jre
    Java version: 9.0.4, vendor: Oracle Corporation, runtime: C:\Program
    Files\Java\jdk-9.0.4
   
    Using:
   
    Java version: 10.0.2, vendor: Oracle Corporation, runtime: C:\Program
    Files\Java\jdk-10.0.2
   
    Yields:
   
    [INFO] -------------------------------------------------------
    [INFO]  T E S T S
    [INFO] -------------------------------------------------------
    [WARNING] Corrupted STDOUT by directly writing to native stream in forked
    JVM 1. See FAQ web page and the dump file
    C:\temp\rc\commons-compress-1.18-src\target\surefire-reports\2018-08-13T12-22-16_818-jvmRun1.dumpstream
    [INFO]
    [INFO] Results:
    [INFO]
    [INFO] Tests run: 0, Failures: 0, Errors: 0, Skipped: 0
    [INFO]
    [INFO]
    ------------------------------------------------------------------------
    [INFO] BUILD FAILURE
    [INFO]
    ------------------------------------------------------------------------
    [INFO] Total time: 24.079 s
    [INFO] Finished at: 2018-08-13T12:22:17-06:00
    [INFO]
    ------------------------------------------------------------------------
    [ERROR] Failed to execute goal
    org.apache.maven.plugins:maven-surefire-plugin:2.22.0:test (default-test)
    on project commons-compress: There are test failures.
    [ERROR]
    [ERROR] Please refer to
    C:\temp\rc\commons-compress-1.18-src\target\surefire-reports for the
    individual test results.
    [ERROR] Please refer to dump files (if any exist) [date]-jvmRun[N].dump,
    [date].dumpstream and [date]-jvmRun[N].dumpstream.
    [ERROR] The forked VM terminated without properly saying goodbye. VM crash
    or System.exit called?
    [ERROR] Command was cmd.exe /X /C ""C:\Program
    Files\Java\jdk-10.0.2\bin\java"
    -javaagent:C:\\Users\\ggregory\\.m2\\repository\\org\\jacoco\\org.jacoco.agent\\0.7.9\\org.jacoco.agent-0.7.9-runtime.jar=destfile=C:\\temp\\rc\\commons-compress-1.18-src\\target\\jacoco.exec
    -jar
    C:\Users\ggregory\AppData\Local\Temp\surefire7209161199370208887\surefirebooter6266538622956665978.jar
    C:\Users\ggregory\AppData\Local\Temp\surefire7209161199370208887
    2018-08-13T12-22-16_818-jvmRun1 surefire11827232589313839809tmp
    surefire_02369712027571769119tmp"
    [ERROR] Error occurred in starting fork, check output in log
    [ERROR] Process Exit Code: 1
    [ERROR] org.apache.maven.surefire.booter.SurefireBooterForkException: The
    forked VM terminated without properly saying goodbye. VM crash or
    System.exit called?
    [ERROR] Command was cmd.exe /X /C ""C:\Program
    Files\Java\jdk-10.0.2\bin\java"
    -javaagent:C:\\Users\\ggregory\\.m2\\repository\\org\\jacoco\\org.jacoco.agent\\0.7.9\\org.jacoco.agent-0.7.9-runtime.jar=destfile=C:\\temp\\rc\\commons-compress-1.18-src\\target\\jacoco.exec
    -jar
    C:\Users\ggregory\AppData\Local\Temp\surefire7209161199370208887\surefirebooter6266538622956665978.jar
    C:\Users\ggregory\AppData\Local\Temp\surefire7209161199370208887
    2018-08-13T12-22-16_818-jvmRun1 surefire11827232589313839809tmp
    surefire_02369712027571769119tmp"
    [ERROR] Error occurred in starting fork, check output in log
    [ERROR] Process Exit Code: 1
    [ERROR]         at
    org.apache.maven.plugin.surefire.booterclient.ForkStarter.fork(ForkStarter.java:671)
    [ERROR]         at
    org.apache.maven.plugin.surefire.booterclient.ForkStarter.fork(ForkStarter.java:533)
    [ERROR]         at
    org.apache.maven.plugin.surefire.booterclient.ForkStarter.run(ForkStarter.java:278)
    [ERROR]         at
    org.apache.maven.plugin.surefire.booterclient.ForkStarter.run(ForkStarter.java:244)
    [ERROR]         at
    org.apache.maven.plugin.surefire.AbstractSurefireMojo.executeProvider(AbstractSurefireMojo.java:1194)
    [ERROR]         at
    org.apache.maven.plugin.surefire.AbstractSurefireMojo.executeAfterPreconditionsChecked(AbstractSurefireMojo.java:1022)
    [ERROR]         at
    org.apache.maven.plugin.surefire.AbstractSurefireMojo.execute(AbstractSurefireMojo.java:868)
    [ERROR]         at
    org.apache.maven.plugin.DefaultBuildPluginManager.executeMojo(DefaultBuildPluginManager.java:137)
    [ERROR]         at
    org.apache.maven.lifecycle.internal.MojoExecutor.execute(MojoExecutor.java:208)
    [ERROR]         at
    org.apache.maven.lifecycle.internal.MojoExecutor.execute(MojoExecutor.java:154)
    [ERROR]         at
    org.apache.maven.lifecycle.internal.MojoExecutor.execute(MojoExecutor.java:146)
    [ERROR]         at
    org.apache.maven.lifecycle.internal.LifecycleModuleBuilder.buildProject(LifecycleModuleBuilder.java:117)
    [ERROR]         at
    org.apache.maven.lifecycle.internal.LifecycleModuleBuilder.buildProject(LifecycleModuleBuilder.java:81)
    [ERROR]         at
    org.apache.maven.lifecycle.internal.builder.singlethreaded.SingleThreadedBuilder.build(SingleThreadedBuilder.java:56)
    [ERROR]         at
    org.apache.maven.lifecycle.internal.LifecycleStarter.execute(LifecycleStarter.java:128)
    [ERROR]         at
    org.apache.maven.DefaultMaven.doExecute(DefaultMaven.java:305)
    [ERROR]         at
    org.apache.maven.DefaultMaven.doExecute(DefaultMaven.java:192)
    [ERROR]         at
    org.apache.maven.DefaultMaven.execute(DefaultMaven.java:105)
    [ERROR]         at org.apache.maven.cli.MavenCli.execute(MavenCli.java:954)
    [ERROR]         at org.apache.maven.cli.MavenCli.doMain(MavenCli.java:288)
    [ERROR]         at org.apache.maven.cli.MavenCli.main(MavenCli.java:192)
    [ERROR]         at
    java.base/jdk.internal.reflect.NativeMethodAccessorImpl.invoke0(Native
    Method)
    [ERROR]         at
    java.base/jdk.internal.reflect.NativeMethodAccessorImpl.invoke(NativeMethodAccessorImpl.java:62)
    [ERROR]         at
    java.base/jdk.internal.reflect.DelegatingMethodAccessorImpl.invoke(DelegatingMethodAccessorImpl.java:43)
    [ERROR]         at
    java.base/java.lang.reflect.Method.invoke(Method.java:564)
    [ERROR]         at
    org.codehaus.plexus.classworlds.launcher.Launcher.launchEnhanced(Launcher.java:289)
    [ERROR]         at
    org.codehaus.plexus.classworlds.launcher.Launcher.launch(Launcher.java:229)
    [ERROR]         at
    org.codehaus.plexus.classworlds.launcher.Launcher.mainWithExitCode(Launcher.java:415)
    [ERROR]         at
    org.codehaus.plexus.classworlds.launcher.Launcher.main(Launcher.java:356)
    [ERROR]
    [ERROR] -> [Help 1]
    [ERROR]
    [ERROR] To see the full stack trace of the errors, re-run Maven with the -e
    switch.
    [ERROR] Re-run Maven using the -X switch to enable full debug logging.
    [ERROR]
    [ERROR] For more information about the errors and possible solutions,
    please read the following articles:
    [ERROR] [Help 1]
    https://urldefense.proofpoint.com/v2/url?u=http-3A__cwiki.apache.org_confluence_display_MAVEN_MojoExecutionException&d=DwIBaQ&c=pLULRYW__RtkwsQUPxJVDGboCTdgji3AcHNJU0BpTJE&r=27OVbTucXn2Bx5CgcyvZLDGrgMPAZgw_bo5aZUpYvprB8wXKlJvJ4ctwSQZcwAnA1zGfkAXdjakcRBcfCJ_XCQ&m=xLDlZE0TY7cPqwoYXuQoB9gi-LqWN1OcFIoE6tNu49Q&s=tZdgwA1JzNP2urSzRqAjhFywOHfrzkEhelvh9R7P-Ds&e=
   
    Using:
   
    Java version: 11-ea, vendor: Oracle Corporation, runtime: C:\Program
    Files\Java\jdk-11
   
    Yields:
   
    [WARNING] Corrupted STDOUT by directly writing to native stream in forked
    JVM 1. See FAQ web page and the dump file
    C:\temp\rc\commons-compress-1.18-src\target\surefire-reports\2018-08-13T12-22-58_446-jvmRun1.dumpstream
    [INFO]
    [INFO] Results:
    [INFO]
    [INFO] Tests run: 0, Failures: 0, Errors: 0, Skipped: 0
    [INFO]
    [INFO]
    ------------------------------------------------------------------------
    [INFO] BUILD FAILURE
    [INFO]
    ------------------------------------------------------------------------
    [INFO] Total time: 28.353 s
    [INFO] Finished at: 2018-08-13T12:22:59-06:00
    [INFO]
    ------------------------------------------------------------------------
    [ERROR] Failed to execute goal
    org.apache.maven.plugins:maven-surefire-plugin:2.22.0:test (default-test)
    on project commons-compress: There are test failures.
    [ERROR]
    [ERROR] Please refer to
    C:\temp\rc\commons-compress-1.18-src\target\surefire-reports for the
    individual test results.
    [ERROR] Please refer to dump files (if any exist) [date]-jvmRun[N].dump,
    [date].dumpstream and [date]-jvmRun[N].dumpstream.
    [ERROR] The forked VM terminated without properly saying goodbye. VM crash
    or System.exit called?
    [ERROR] Command was cmd.exe /X /C ""C:\Program Files\Java\jdk-11\bin\java"
    -javaagent:C:\\Users\\ggregory\\.m2\\repository\\org\\jacoco\\org.jacoco.agent\\0.7.9\\org.jacoco.agent-0.7.9-runtime.jar=destfile=C:\\temp\\rc\\commons-compress-1.18-src\\target\\jacoco.exec
    -jar
    C:\Users\ggregory\AppData\Local\Temp\surefire10152433741820882744\surefirebooter10168740296210520300.jar
    C:\Users\ggregory\AppData\Local\Temp\surefire10152433741820882744
    2018-08-13T12-22-58_446-jvmRun1 surefire5688114630607158967tmp
    surefire_07256248504558504511tmp"
    [ERROR] Error occurred in starting fork, check output in log
    [ERROR] Process Exit Code: 1
    [ERROR] org.apache.maven.surefire.booter.SurefireBooterForkException: The
    forked VM terminated without properly saying goodbye. VM crash or
    System.exit called?
    [ERROR] Command was cmd.exe /X /C ""C:\Program Files\Java\jdk-11\bin\java"
    -javaagent:C:\\Users\\ggregory\\.m2\\repository\\org\\jacoco\\org.jacoco.agent\\0.7.9\\org.jacoco.agent-0.7.9-runtime.jar=destfile=C:\\temp\\rc\\commons-compress-1.18-src\\target\\jacoco.exec
    -jar
    C:\Users\ggregory\AppData\Local\Temp\surefire10152433741820882744\surefirebooter10168740296210520300.jar
    C:\Users\ggregory\AppData\Local\Temp\surefire10152433741820882744
    2018-08-13T12-22-58_446-jvmRun1 surefire5688114630607158967tmp
    surefire_07256248504558504511tmp"
    [ERROR] Error occurred in starting fork, check output in log
    [ERROR] Process Exit Code: 1
    [ERROR]         at
    org.apache.maven.plugin.surefire.booterclient.ForkStarter.fork(ForkStarter.java:671)
    [ERROR]         at
    org.apache.maven.plugin.surefire.booterclient.ForkStarter.fork(ForkStarter.java:533)
    [ERROR]         at
    org.apache.maven.plugin.surefire.booterclient.ForkStarter.run(ForkStarter.java:278)
    [ERROR]         at
    org.apache.maven.plugin.surefire.booterclient.ForkStarter.run(ForkStarter.java:244)
    [ERROR]         at
    org.apache.maven.plugin.surefire.AbstractSurefireMojo.executeProvider(AbstractSurefireMojo.java:1194)
    [ERROR]         at
    org.apache.maven.plugin.surefire.AbstractSurefireMojo.executeAfterPreconditionsChecked(AbstractSurefireMojo.java:1022)
    [ERROR]         at
    org.apache.maven.plugin.surefire.AbstractSurefireMojo.execute(AbstractSurefireMojo.java:868)
    [ERROR]         at
    org.apache.maven.plugin.DefaultBuildPluginManager.executeMojo(DefaultBuildPluginManager.java:137)
    [ERROR]         at
    org.apache.maven.lifecycle.internal.MojoExecutor.execute(MojoExecutor.java:208)
    [ERROR]         at
    org.apache.maven.lifecycle.internal.MojoExecutor.execute(MojoExecutor.java:154)
    [ERROR]         at
    org.apache.maven.lifecycle.internal.MojoExecutor.execute(MojoExecutor.java:146)
    [ERROR]         at
    org.apache.maven.lifecycle.internal.LifecycleModuleBuilder.buildProject(LifecycleModuleBuilder.java:117)
    [ERROR]         at
    org.apache.maven.lifecycle.internal.LifecycleModuleBuilder.buildProject(LifecycleModuleBuilder.java:81)
    [ERROR]         at
    org.apache.maven.lifecycle.internal.builder.singlethreaded.SingleThreadedBuilder.build(SingleThreadedBuilder.java:56)
    [ERROR]         at
    org.apache.maven.lifecycle.internal.LifecycleStarter.execute(LifecycleStarter.java:128)
    [ERROR]         at
    org.apache.maven.DefaultMaven.doExecute(DefaultMaven.java:305)
    [ERROR]         at
    org.apache.maven.DefaultMaven.doExecute(DefaultMaven.java:192)
    [ERROR]         at
    org.apache.maven.DefaultMaven.execute(DefaultMaven.java:105)
    [ERROR]         at org.apache.maven.cli.MavenCli.execute(MavenCli.java:954)
    [ERROR]         at org.apache.maven.cli.MavenCli.doMain(MavenCli.java:288)
    [ERROR]         at org.apache.maven.cli.MavenCli.main(MavenCli.java:192)
    [ERROR]         at
    java.base/jdk.internal.reflect.NativeMethodAccessorImpl.invoke0(Native
    Method)
    [ERROR]         at
    java.base/jdk.internal.reflect.NativeMethodAccessorImpl.invoke(NativeMethodAccessorImpl.java:62)
    [ERROR]         at
    java.base/jdk.internal.reflect.DelegatingMethodAccessorImpl.invoke(DelegatingMethodAccessorImpl.java:43)
    [ERROR]         at
    java.base/java.lang.reflect.Method.invoke(Method.java:566)
    [ERROR]         at
    org.codehaus.plexus.classworlds.launcher.Launcher.launchEnhanced(Launcher.java:289)
    [ERROR]         at
    org.codehaus.plexus.classworlds.launcher.Launcher.launch(Launcher.java:229)
    [ERROR]         at
    org.codehaus.plexus.classworlds.launcher.Launcher.mainWithExitCode(Launcher.java:415)
    [ERROR]         at
    org.codehaus.plexus.classworlds.launcher.Launcher.main(Launcher.java:356)
    [ERROR]
    [ERROR] -> [Help 1]
    [ERROR]
    [ERROR] To see the full stack trace of the errors, re-run Maven with the -e
    switch.
    [ERROR] Re-run Maven using the -X switch to enable full debug logging.
    [ERROR]
    [ERROR] For more information about the errors and possible solutions,
    please read the following articles:
    [ERROR] [Help 1]
    https://urldefense.proofpoint.com/v2/url?u=http-3A__cwiki.apache.org_confluence_display_MAVEN_MojoExecutionException&d=DwIBaQ&c=pLULRYW__RtkwsQUPxJVDGboCTdgji3AcHNJU0BpTJE&r=27OVbTucXn2Bx5CgcyvZLDGrgMPAZgw_bo5aZUpYvprB8wXKlJvJ4ctwSQZcwAnA1zGfkAXdjakcRBcfCJ_XCQ&m=xLDlZE0TY7cPqwoYXuQoB9gi-LqWN1OcFIoE6tNu49Q&s=tZdgwA1JzNP2urSzRqAjhFywOHfrzkEhelvh9R7P-Ds&e=
   
    Using:
   
    Java version: 12-ea, vendor: Oracle Corporation, runtime: C:\Program
    Files\Java\jdk-12
   
    Yields:
   
    [WARNING] Corrupted STDOUT by directly writing to native stream in forked
    JVM 1. See FAQ web page and the dump file
    C:\temp\rc\commons-compress-1.18-src\target\surefire-reports\2018-08-13T12-23-49_099-jvmRun1.dumpstream
    [INFO]
    [INFO] Results:
    [INFO]
    [INFO] Tests run: 0, Failures: 0, Errors: 0, Skipped: 0
    [INFO]
    [INFO]
    ------------------------------------------------------------------------
    [INFO] BUILD FAILURE
    [INFO]
    ------------------------------------------------------------------------
    [INFO] Total time: 29.052 s
    [INFO] Finished at: 2018-08-13T12:23:50-06:00
    [INFO]
    ------------------------------------------------------------------------
    [ERROR] Failed to execute goal
    org.apache.maven.plugins:maven-surefire-plugin:2.22.0:test (default-test)
    on project commons-compress: There are test failures.
    [ERROR]
    [ERROR] Please refer to
    C:\temp\rc\commons-compress-1.18-src\target\surefire-reports for the
    individual test results.
    [ERROR] Please refer to dump files (if any exist) [date]-jvmRun[N].dump,
    [date].dumpstream and [date]-jvmRun[N].dumpstream.
    [ERROR] The forked VM terminated without properly saying goodbye. VM crash
    or System.exit called?
    [ERROR] Command was cmd.exe /X /C ""C:\Program Files\Java\jdk-12\bin\java"
    -javaagent:C:\\Users\\ggregory\\.m2\\repository\\org\\jacoco\\org.jacoco.agent\\0.7.9\\org.jacoco.agent-0.7.9-runtime.jar=destfile=C:\\temp\\rc\\commons-compress-1.18-src\\target\\jacoco.exec
    -jar
    C:\Users\ggregory\AppData\Local\Temp\surefire8301946583772802113\surefirebooter15881330005429776497.jar
    C:\Users\ggregory\AppData\Local\Temp\surefire8301946583772802113
    2018-08-13T12-23-49_099-jvmRun1 surefire14071758946483068675tmp
    surefire_018368184688824352589tmp"
    [ERROR] Error occurred in starting fork, check output in log
    [ERROR] Process Exit Code: 1
    [ERROR] org.apache.maven.surefire.booter.SurefireBooterForkException: The
    forked VM terminated without properly saying goodbye. VM crash or
    System.exit called?
    [ERROR] Command was cmd.exe /X /C ""C:\Program Files\Java\jdk-12\bin\java"
    -javaagent:C:\\Users\\ggregory\\.m2\\repository\\org\\jacoco\\org.jacoco.agent\\0.7.9\\org.jacoco.agent-0.7.9-runtime.jar=destfile=C:\\temp\\rc\\commons-compress-1.18-src\\target\\jacoco.exec
    -jar
    C:\Users\ggregory\AppData\Local\Temp\surefire8301946583772802113\surefirebooter15881330005429776497.jar
    C:\Users\ggregory\AppData\Local\Temp\surefire8301946583772802113
    2018-08-13T12-23-49_099-jvmRun1 surefire14071758946483068675tmp
    surefire_018368184688824352589tmp"
    [ERROR] Error occurred in starting fork, check output in log
    [ERROR] Process Exit Code: 1
    [ERROR]         at
    org.apache.maven.plugin.surefire.booterclient.ForkStarter.fork(ForkStarter.java:671)
    [ERROR]         at
    org.apache.maven.plugin.surefire.booterclient.ForkStarter.fork(ForkStarter.java:533)
    [ERROR]         at
    org.apache.maven.plugin.surefire.booterclient.ForkStarter.run(ForkStarter.java:278)
    [ERROR]         at
    org.apache.maven.plugin.surefire.booterclient.ForkStarter.run(ForkStarter.java:244)
    [ERROR]         at
    org.apache.maven.plugin.surefire.AbstractSurefireMojo.executeProvider(AbstractSurefireMojo.java:1194)
    [ERROR]         at
    org.apache.maven.plugin.surefire.AbstractSurefireMojo.executeAfterPreconditionsChecked(AbstractSurefireMojo.java:1022)
    [ERROR]         at
    org.apache.maven.plugin.surefire.AbstractSurefireMojo.execute(AbstractSurefireMojo.java:868)
    [ERROR]         at
    org.apache.maven.plugin.DefaultBuildPluginManager.executeMojo(DefaultBuildPluginManager.java:137)
    [ERROR]         at
    org.apache.maven.lifecycle.internal.MojoExecutor.execute(MojoExecutor.java:208)
    [ERROR]         at
    org.apache.maven.lifecycle.internal.MojoExecutor.execute(MojoExecutor.java:154)
    [ERROR]         at
    org.apache.maven.lifecycle.internal.MojoExecutor.execute(MojoExecutor.java:146)
    [ERROR]         at
    org.apache.maven.lifecycle.internal.LifecycleModuleBuilder.buildProject(LifecycleModuleBuilder.java:117)
    [ERROR]         at
    org.apache.maven.lifecycle.internal.LifecycleModuleBuilder.buildProject(LifecycleModuleBuilder.java:81)
    [ERROR]         at
    org.apache.maven.lifecycle.internal.builder.singlethreaded.SingleThreadedBuilder.build(SingleThreadedBuilder.java:56)
    [ERROR]         at
    org.apache.maven.lifecycle.internal.LifecycleStarter.execute(LifecycleStarter.java:128)
    [ERROR]         at
    org.apache.maven.DefaultMaven.doExecute(DefaultMaven.java:305)
    [ERROR]         at
    org.apache.maven.DefaultMaven.doExecute(DefaultMaven.java:192)
    [ERROR]         at
    org.apache.maven.DefaultMaven.execute(DefaultMaven.java:105)
    [ERROR]         at org.apache.maven.cli.MavenCli.execute(MavenCli.java:954)
    [ERROR]         at org.apache.maven.cli.MavenCli.doMain(MavenCli.java:288)
    [ERROR]         at org.apache.maven.cli.MavenCli.main(MavenCli.java:192)
    [ERROR]         at
    java.base/jdk.internal.reflect.NativeMethodAccessorImpl.invoke0(Native
    Method)
    [ERROR]         at
    java.base/jdk.internal.reflect.NativeMethodAccessorImpl.invoke(NativeMethodAccessorImpl.java:62)
    [ERROR]         at
    java.base/jdk.internal.reflect.DelegatingMethodAccessorImpl.invoke(DelegatingMethodAccessorImpl.java:43)
    [ERROR]         at
    java.base/java.lang.reflect.Method.invoke(Method.java:566)
    [ERROR]         at
    org.codehaus.plexus.classworlds.launcher.Launcher.launchEnhanced(Launcher.java:289)
    [ERROR]         at
    org.codehaus.plexus.classworlds.launcher.Launcher.launch(Launcher.java:229)
    [ERROR]         at
    org.codehaus.plexus.classworlds.launcher.Launcher.mainWithExitCode(Launcher.java:415)
    [ERROR]         at
    org.codehaus.plexus.classworlds.launcher.Launcher.main(Launcher.java:356)
    [ERROR]
    [ERROR] -> [Help 1]
    [ERROR]
    [ERROR] To see the full stack trace of the errors, re-run Maven with the -e
    switch.
    [ERROR] Re-run Maven using the -X switch to enable full debug logging.
    [ERROR]
    [ERROR] For more information about the errors and possible solutions,
    please read the following articles:
    [ERROR] [Help 1]
    https://urldefense.proofpoint.com/v2/url?u=http-3A__cwiki.apache.org_confluence_display_MAVEN_MojoExecutionException&d=DwIBaQ&c=pLULRYW__RtkwsQUPxJVDGboCTdgji3AcHNJU0BpTJE&r=27OVbTucXn2Bx5CgcyvZLDGrgMPAZgw_bo5aZUpYvprB8wXKlJvJ4ctwSQZcwAnA1zGfkAXdjakcRBcfCJ_XCQ&m=xLDlZE0TY7cPqwoYXuQoB9gi-LqWN1OcFIoE6tNu49Q&s=tZdgwA1JzNP2urSzRqAjhFywOHfrzkEhelvh9R7P-Ds&e=
   
    Gary
   
    On Mon, Aug 13, 2018 at 1:44 AM Stefan Bodewig <[hidden email]> wrote:
   
    > Hi all,
    >
    > I would like to release Compress 1.18.
    >
    > Compress 1.18 RC1 is available for review here:
    >     https://urldefense.proofpoint.com/v2/url?u=https-3A__dist.apache.org_repos_dist_dev_commons_compress_&d=DwIBaQ&c=pLULRYW__RtkwsQUPxJVDGboCTdgji3AcHNJU0BpTJE&r=27OVbTucXn2Bx5CgcyvZLDGrgMPAZgw_bo5aZUpYvprB8wXKlJvJ4ctwSQZcwAnA1zGfkAXdjakcRBcfCJ_XCQ&m=xLDlZE0TY7cPqwoYXuQoB9gi-LqWN1OcFIoE6tNu49Q&s=V1MZFZLiPGhgF3UYdarBOVHnhMjRu7l5l2LHTry0xbE&e= (svn
    > revision 28684)
    >
    > The tag is here:
    >     tag 1.18-RC1 on commit b95d5cde
    >
    > https://urldefense.proofpoint.com/v2/url?u=https-3A__git-2Dwip-2Dus.apache.org_repos_asf-3Fp-3Dcommons-2Dcompress.git-3Ba-3Dcommit-3Bh-3Db95d5cde4c68640f886e3c6802384fae47408a37&d=DwIBaQ&c=pLULRYW__RtkwsQUPxJVDGboCTdgji3AcHNJU0BpTJE&r=27OVbTucXn2Bx5CgcyvZLDGrgMPAZgw_bo5aZUpYvprB8wXKlJvJ4ctwSQZcwAnA1zGfkAXdjakcRBcfCJ_XCQ&m=xLDlZE0TY7cPqwoYXuQoB9gi-LqWN1OcFIoE6tNu49Q&s=yKv48hvhIjSAbQljBhNHrnpfzmPhwuZ1kGuhKgHP6h4&e=
    >
    > Maven artifacts are here:
    >
    > https://urldefense.proofpoint.com/v2/url?u=https-3A__repository.apache.org_content_repositories_orgapachecommons-2D1367_org_apache_commons_commons-2Dcompress_1.18_&d=DwIBaQ&c=pLULRYW__RtkwsQUPxJVDGboCTdgji3AcHNJU0BpTJE&r=27OVbTucXn2Bx5CgcyvZLDGrgMPAZgw_bo5aZUpYvprB8wXKlJvJ4ctwSQZcwAnA1zGfkAXdjakcRBcfCJ_XCQ&m=xLDlZE0TY7cPqwoYXuQoB9gi-LqWN1OcFIoE6tNu49Q&s=zGLW9kEBSMImqRJXk1UdAoIRmOgxGWj_aeubL8o6CjE&e=
    >
    > These are the Maven artifacts and their SHA256 hashes
    >
    > 5f2df1e467825e4cac5996d44890c4201c000b43c0b23cffc0782d28a0beb9b0
    > commons-compress-1.18.jar
    > 23b382156431d6350745c571e533fabe28aebe8da1de6e039e8e480bb9764dfc
    > commons-compress-1.18-javadoc.jar
    > c8e6896eb3d3880ffc21bb93d563b7cc0d3e2152c8181f261a748502290a5947
    > commons-compress-1.18-sources.jar
    > 630a8c16d58d2d7475c82a98b032390831d22589bccd0f9086e95e85742a41b3
    > commons-compress-1.18-tests.jar
    > ea06230ae8f1ef954da571d3bb13c2324fee703d7cfee2699a76d3793b531cec
    > commons-compress-1.18-test-sources.jar
    > 672c5fe92bd3eab43e8d53338cad5ca073b6529de4eb2b38859a3eaa6c9e8119
    > commons-compress-1.18.pom
    >
    > I have tested this with JDK 8 using Maven 3.5.4.
    >
    > Details of changes since 1.17 are in the release notes:
    >
    > https://urldefense.proofpoint.com/v2/url?u=https-3A__dist.apache.org_repos_dist_dev_commons_compress_RELEASE-2DNOTES.txt&d=DwIBaQ&c=pLULRYW__RtkwsQUPxJVDGboCTdgji3AcHNJU0BpTJE&r=27OVbTucXn2Bx5CgcyvZLDGrgMPAZgw_bo5aZUpYvprB8wXKlJvJ4ctwSQZcwAnA1zGfkAXdjakcRBcfCJ_XCQ&m=xLDlZE0TY7cPqwoYXuQoB9gi-LqWN1OcFIoE6tNu49Q&s=Lo6wY2CMASywSX6sEOmWTTlyeUmP6cozMN4RbqSJd_s&e=
    >
    > https://urldefense.proofpoint.com/v2/url?u=https-3A__stefan.samaflost.de_staging_commons-2Dcompress-2D1.18_changes-2Dreport.html&d=DwIBaQ&c=pLULRYW__RtkwsQUPxJVDGboCTdgji3AcHNJU0BpTJE&r=27OVbTucXn2Bx5CgcyvZLDGrgMPAZgw_bo5aZUpYvprB8wXKlJvJ4ctwSQZcwAnA1zGfkAXdjakcRBcfCJ_XCQ&m=xLDlZE0TY7cPqwoYXuQoB9gi-LqWN1OcFIoE6tNu49Q&s=T-anPElEnjsjeFenYiNemz_w1vfyKQQa4fYYv5d-Ero&e=
    >
    > Site:
    >     https://urldefense.proofpoint.com/v2/url?u=https-3A__stefan.samaflost.de_staging_commons-2Dcompress-2D1.18_&d=DwIBaQ&c=pLULRYW__RtkwsQUPxJVDGboCTdgji3AcHNJU0BpTJE&r=27OVbTucXn2Bx5CgcyvZLDGrgMPAZgw_bo5aZUpYvprB8wXKlJvJ4ctwSQZcwAnA1zGfkAXdjakcRBcfCJ_XCQ&m=xLDlZE0TY7cPqwoYXuQoB9gi-LqWN1OcFIoE6tNu49Q&s=1ep8EWnsGwy2GkXEJrxDjNzxdUxDkJk3hqlxH7rHnF0&e=
    >
    >     as usual this is not the site I'm going to publish after the
    >     release, I'll re-create the site when the release date is
    >     clear. The download link and 1.18 javadoc link won't work right
    >     now.
    >
    > japicmp Report (compared to 1.17):
    >     https://urldefense.proofpoint.com/v2/url?u=https-3A__stefan.samaflost.de_staging_commons-2Dcompress-2D1.18_japicmp.html&d=DwIBaQ&c=pLULRYW__RtkwsQUPxJVDGboCTdgji3AcHNJU0BpTJE&r=27OVbTucXn2Bx5CgcyvZLDGrgMPAZgw_bo5aZUpYvprB8wXKlJvJ4ctwSQZcwAnA1zGfkAXdjakcRBcfCJ_XCQ&m=xLDlZE0TY7cPqwoYXuQoB9gi-LqWN1OcFIoE6tNu49Q&s=Y8iZUBid8bj9D9m6776veLeOWe9VqrJtfMSokkjBMvo&e=
    >
    > RAT Report:
    >
    > https://urldefense.proofpoint.com/v2/url?u=https-3A__stefan.samaflost.de_staging_commons-2Dcompress-2D1.18_rat-2Dreport.html&d=DwIBaQ&c=pLULRYW__RtkwsQUPxJVDGboCTdgji3AcHNJU0BpTJE&r=27OVbTucXn2Bx5CgcyvZLDGrgMPAZgw_bo5aZUpYvprB8wXKlJvJ4ctwSQZcwAnA1zGfkAXdjakcRBcfCJ_XCQ&m=xLDlZE0TY7cPqwoYXuQoB9gi-LqWN1OcFIoE6tNu49Q&s=3bqM_tY3Oe-wtJuuwcL738jg1EpxK-ZY_pjEcO_BrDo&e=
    >
    > KEYS:
    >   https://urldefense.proofpoint.com/v2/url?u=https-3A__www.apache.org_dist_commons_KEYS&d=DwIBaQ&c=pLULRYW__RtkwsQUPxJVDGboCTdgji3AcHNJU0BpTJE&r=27OVbTucXn2Bx5CgcyvZLDGrgMPAZgw_bo5aZUpYvprB8wXKlJvJ4ctwSQZcwAnA1zGfkAXdjakcRBcfCJ_XCQ&m=xLDlZE0TY7cPqwoYXuQoB9gi-LqWN1OcFIoE6tNu49Q&s=lFy-5RpemfFcaABlXxOdi9P637EMaByZ6OxyQQe5VAQ&e=
    >
    > Please review the release candidate and vote.
    > This vote will close no sooner that 72 hours from now,
    > i.e. sometime after 08:00 UTC 16-August 2018
    >
    >   [ ] +1 Release these artifacts
    >   [ ] +0 OK, but...
    >   [ ] -0 OK, but really should fix...
    >   [ ] -1 I oppose this release because...
    >
    > Thanks!
    >
    >         Stefan
    >
    > ---------------------------------------------------------------------
    > To unsubscribe, e-mail: [hidden email]
    > For additional commands, e-mail: [hidden email]
    >
    >
   

________________________________________________________

The information contained in this e-mail is confidential and/or proprietary to Capital One and/or its affiliates and may only be used solely in performance of work or services for Capital One. The information transmitted herewith is intended only for use by the individual or entity to which it is addressed. If the reader of this message is not the intended recipient, you are hereby notified that any review, retransmission, dissemination, distribution, copying or other use of, or taking of any action in reliance upon this information is strictly prohibited. If you have received this communication in error, please contact the sender and delete the material from your computer.

---------------------------------------------------------------------
To unsubscribe, e-mail: [hidden email]
For additional commands, e-mail: [hidden email]
Reply | Threaded
Open this post in threaded view
|

Re: [VOTE] Release Compress 1.18 based on RC1

Rob Tompkins
In reply to this post by Stefan Bodewig
+1

'mvn clean test package site' works with
$ mvn -version
Apache Maven 3.5.4 (1edded0938998edf8bf061f1ceb3cfdeccf443fe; 2018-06-17T14:33:14-04:00)
Maven home: /usr/local/Cellar/maven/3.5.4/libexec
Java version: 1.8.0_172, vendor: Oracle Corporation, runtime: /Library/Java/JavaVirtualMachines/jdk1.8.0_172.jdk/Contents/Home/jre
Default locale: en_US, platform encoding: UTF-8

mvn clean test works on java7 and java9.


Must fix during artifact promotion:
(1) Signature files contain more than the correct signatures (note the contents below):
        $ cat commons-compress-1.18-bin.tar.gz.sha256
        41414aba58f49d68b3cac598e59e6a5738a97248402d7cae0b10673202fe3c32  commons-compress-1.18-bin.tar.gz
        $ cat commons-compress-1.18-bin.zip.sha256
        ff2134b70face7722b39758926849379e76bc2816dd7c6b4906632b4361e8908  commons-compress-1.18-bin.zip
        $ cat commons-compress-1.18-src.tar.gz.sha256
        93d4f8394ef1b18b10e8ab116137aa4c2484ec30fba29ab20094b781b69d1b2a  commons-compress-1.18-src.tar.gz
        $ cat commons-compress-1.18-src.zip.sha256
        26bf735a5caf773532eebb88544fba45f7839fe45f5426f4df0a3c58694e2166  commons-compress-1.18-src.zip

Nits:
(1) .asc files have .md5s and .sha1s up in nexus (curiousity, but no worries).
(2) Gary's build nit.
(3) Java10 test failures.


> On Aug 13, 2018, at 3:44 AM, Stefan Bodewig <[hidden email]> wrote:
>
> Hi all,
>
> I would like to release Compress 1.18.
>
> Compress 1.18 RC1 is available for review here:
>    https://dist.apache.org/repos/dist/dev/commons/compress/ (svn revision 28684)
>
> The tag is here:
>    tag 1.18-RC1 on commit b95d5cde
>    https://git-wip-us.apache.org/repos/asf?p=commons-compress.git;a=commit;h=b95d5cde4c68640f886e3c6802384fae47408a37
>
> Maven artifacts are here:
>    https://repository.apache.org/content/repositories/orgapachecommons-1367/org/apache/commons/commons-compress/1.18/
>
> These are the Maven artifacts and their SHA256 hashes
>
> 5f2df1e467825e4cac5996d44890c4201c000b43c0b23cffc0782d28a0beb9b0  commons-compress-1.18.jar
> 23b382156431d6350745c571e533fabe28aebe8da1de6e039e8e480bb9764dfc  commons-compress-1.18-javadoc.jar
> c8e6896eb3d3880ffc21bb93d563b7cc0d3e2152c8181f261a748502290a5947  commons-compress-1.18-sources.jar
> 630a8c16d58d2d7475c82a98b032390831d22589bccd0f9086e95e85742a41b3  commons-compress-1.18-tests.jar
> ea06230ae8f1ef954da571d3bb13c2324fee703d7cfee2699a76d3793b531cec  commons-compress-1.18-test-sources.jar
> 672c5fe92bd3eab43e8d53338cad5ca073b6529de4eb2b38859a3eaa6c9e8119  commons-compress-1.18.pom
>
> I have tested this with JDK 8 using Maven 3.5.4.
>
> Details of changes since 1.17 are in the release notes:
>    https://dist.apache.org/repos/dist/dev/commons/compress/RELEASE-NOTES.txt
>    https://stefan.samaflost.de/staging/commons-compress-1.18/changes-report.html
>
> Site:
>    https://stefan.samaflost.de/staging/commons-compress-1.18/
>
>    as usual this is not the site I'm going to publish after the
>    release, I'll re-create the site when the release date is
>    clear. The download link and 1.18 javadoc link won't work right
>    now.
>
> japicmp Report (compared to 1.17):
>    https://stefan.samaflost.de/staging/commons-compress-1.18/japicmp.html
>
> RAT Report:
>    https://stefan.samaflost.de/staging/commons-compress-1.18/rat-report.html
>
> KEYS:
>  https://www.apache.org/dist/commons/KEYS
>
> Please review the release candidate and vote.
> This vote will close no sooner that 72 hours from now,
> i.e. sometime after 08:00 UTC 16-August 2018
>
>  [ ] +1 Release these artifacts
>  [ ] +0 OK, but...
>  [ ] -0 OK, but really should fix...
>  [ ] -1 I oppose this release because...
>
> Thanks!
>
>        Stefan
>
> ---------------------------------------------------------------------
> To unsubscribe, e-mail: [hidden email]
> For additional commands, e-mail: [hidden email]
>


---------------------------------------------------------------------
To unsubscribe, e-mail: [hidden email]
For additional commands, e-mail: [hidden email]

Reply | Threaded
Open this post in threaded view
|

Re: [VOTE] Release Compress 1.18 based on RC1

Stefan Bodewig
In reply to this post by garydgregory
On 2018-08-13, Gary Gregory wrote:

>> From src zip: ASC, SHA256 OK.
> In the future we should only publish SHA512 hashes.

can do.

> Site typo: "It is no possible to specifiy various parameters for Zstd
> output."
> -> "It is *now *possible to *specify *various parameters for Zstd output."

Thanks, fixed in mater, will be fixed when I publish the site after
merging.

> changes.xml needs a release date (I usually try to remember to do this as
> part of the RC.)

As usual, yes. I've had to many failed RC votes that I don't bother
predicting the releas date anymore.

> [INFO] Skipping JaCoCo execution due to missing execution data file.
> Aug 13, 2018 12:05:21 PM
> net.sourceforge.pmd.lang.java.typeresolution.ClassTypeResolver visit
> WARNING: Could not find class
> org.apache.commons.compress.archivers.sevenz.LZMADecoder, due to:
> java.lang.IllegalAccessError: class
> org.apache.commons.compress.archivers.sevenz.LZMADecoder cannot access its
> superclass org.apache.commons.compress.archivers.sevenz.CoderBase

I don't know, but the warning has been there for a long time. It is a
false positive.

> Nit:

> [INFO] --- maven-compiler-plugin:3.7.0:compile (default-compile) @
> commons-compress ---
> [INFO] Changes detected - recompiling the module!
> [INFO] Compiling 206 source files to
> C:\temp\rc\commons-compress-1.18-src\target\classes
> [INFO]
> /C:/temp/rc/commons-compress-1.18-src/src/main/java/org/apache/commons/compress/utils/Sets.java:
> C:\temp\rc\commons-compress-1.18-src\src\main\java\org\apache\commons\compress\utils\Sets.java
> uses unchecked or unsafe operations.
> [INFO]
> /C:/temp/rc/commons-compress-1.18-src/src/main/java/org/apache/commons/compress/utils/Sets.java:
> Recompile with -Xlint:unchecked for details.

I've overlooked that and must have done for quite some time. The class
hasn't been touched for more than a year.

> Too bad we get multiple instances of ProjectBuildingException:

> [INFO] Generating "Dependencies" report  ---
> maven-project-info-reports-plugin:3.0.0:dependencies
> [WARNING] Unable to create Maven project from repository.
> org.apache.maven.project.ProjectBuildingException: Some problems were
> encountered while processing the POMs:
> [ERROR] Unknown packaging: bundle @ line 6, column 16

Yes, I've seen that, but have no idea how to fix that. It seems the
dependency plugin doesn't know "bundle" packaging but some of the (test)
dependencies use it. No idea how we could fix that.

> Using:

> Java version: 10.0.2, vendor: Oracle Corporation, runtime: C:\Program
> Files\Java\jdk-10.0.2

> Yields:

> [INFO] -------------------------------------------------------
> [INFO]  T E S T S
> [INFO] -------------------------------------------------------
> [WARNING] Corrupted STDOUT by directly writing to native stream in forked
> JVM 1. See FAQ web page and the dump file
> C:\temp\rc\commons-compress-1.18-src\target\surefire-reports\2018-08-13T12-22-16_818-jvmRun1.dumpstream

This happens in Jenkins as well and I don't know how to fix it. I think
I once looked into it and it is a known Surefire issue.

Stefan

---------------------------------------------------------------------
To unsubscribe, e-mail: [hidden email]
For additional commands, e-mail: [hidden email]

Reply | Threaded
Open this post in threaded view
|

Re: [VOTE] Release Compress 1.18 based on RC1

garydgregory
On Mon, Aug 13, 2018 at 10:21 PM Stefan Bodewig <[hidden email]> wrote:

> On 2018-08-13, Gary Gregory wrote:
>
> >> From src zip: ASC, SHA256 OK.
> > In the future we should only publish SHA512 hashes.
>
> can do.
>
> > Site typo: "It is no possible to specifiy various parameters for Zstd
> > output."
> > -> "It is *now *possible to *specify *various parameters for Zstd
> output."
>
> Thanks, fixed in mater, will be fixed when I publish the site after
> merging.
>
> > changes.xml needs a release date (I usually try to remember to do this as
> > part of the RC.)
>
> As usual, yes. I've had to many failed RC votes that I don't bother
> predicting the releas date anymore.
>
> > [INFO] Skipping JaCoCo execution due to missing execution data file.
> > Aug 13, 2018 12:05:21 PM
> > net.sourceforge.pmd.lang.java.typeresolution.ClassTypeResolver visit
> > WARNING: Could not find class
> > org.apache.commons.compress.archivers.sevenz.LZMADecoder, due to:
> > java.lang.IllegalAccessError: class
> > org.apache.commons.compress.archivers.sevenz.LZMADecoder cannot access
> its
> > superclass org.apache.commons.compress.archivers.sevenz.CoderBase
>
> I don't know, but the warning has been there for a long time. It is a
> false positive.
>
> > Nit:
>
> > [INFO] --- maven-compiler-plugin:3.7.0:compile (default-compile) @
> > commons-compress ---
> > [INFO] Changes detected - recompiling the module!
> > [INFO] Compiling 206 source files to
> > C:\temp\rc\commons-compress-1.18-src\target\classes
> > [INFO]
> >
> /C:/temp/rc/commons-compress-1.18-src/src/main/java/org/apache/commons/compress/utils/Sets.java:
> >
> C:\temp\rc\commons-compress-1.18-src\src\main\java\org\apache\commons\compress\utils\Sets.java
> > uses unchecked or unsafe operations.
> > [INFO]
> >
> /C:/temp/rc/commons-compress-1.18-src/src/main/java/org/apache/commons/compress/utils/Sets.java:
> > Recompile with -Xlint:unchecked for details.
>
> I've overlooked that and must have done for quite some time. The class
> hasn't been touched for more than a year.
>
> > Too bad we get multiple instances of ProjectBuildingException:
>
> > [INFO] Generating "Dependencies" report  ---
> > maven-project-info-reports-plugin:3.0.0:dependencies
> > [WARNING] Unable to create Maven project from repository.
> > org.apache.maven.project.ProjectBuildingException: Some problems were
> > encountered while processing the POMs:
> > [ERROR] Unknown packaging: bundle @ line 6, column 16
>
> Yes, I've seen that, but have no idea how to fix that. It seems the
> dependency plugin doesn't know "bundle" packaging but some of the (test)
> dependencies use it. No idea how we could fix that.
>
> > Using:
>
> > Java version: 10.0.2, vendor: Oracle Corporation, runtime: C:\Program
> > Files\Java\jdk-10.0.2
>
> > Yields:
>
> > [INFO] -------------------------------------------------------
> > [INFO]  T E S T S
> > [INFO] -------------------------------------------------------
> > [WARNING] Corrupted STDOUT by directly writing to native stream in forked
> > JVM 1. See FAQ web page and the dump file
> >
> C:\temp\rc\commons-compress-1.18-src\target\surefire-reports\2018-08-13T12-22-16_818-jvmRun1.dumpstream
>
> This happens in Jenkins as well and I don't know how to fix it. I think
> I once looked into it and it is a known Surefire issue.
>

OK, thanks for all your comments. I suppose we will see if the latest
Surefire fixes this which we can pick up in the next [parent] release.

Gary

>
> Stefan
>
Reply | Threaded
Open this post in threaded view
|

Re: [VOTE] Release Compress 1.18 based on RC1

garydgregory
In reply to this post by Stefan Bodewig
On Mon, Aug 13, 2018 at 10:21 PM Stefan Bodewig <[hidden email]> wrote:

> On 2018-08-13, Gary Gregory wrote:
>
> >> From src zip: ASC, SHA256 OK.
> > In the future we should only publish SHA512 hashes.
>
> can do.
>
> > Site typo: "It is no possible to specifiy various parameters for Zstd
> > output."
> > -> "It is *now *possible to *specify *various parameters for Zstd
> output."
>
> Thanks, fixed in mater, will be fixed when I publish the site after
> merging.
>

I do not predict it, I just pick the date of the RC ;-)

Gary

>
> > changes.xml needs a release date (I usually try to remember to do this as
> > part of the RC.)
>
> As usual, yes. I've had to many failed RC votes that I don't bother
> predicting the releas date anymore.
>
> > [INFO] Skipping JaCoCo execution due to missing execution data file.
> > Aug 13, 2018 12:05:21 PM
> > net.sourceforge.pmd.lang.java.typeresolution.ClassTypeResolver visit
> > WARNING: Could not find class
> > org.apache.commons.compress.archivers.sevenz.LZMADecoder, due to:
> > java.lang.IllegalAccessError: class
> > org.apache.commons.compress.archivers.sevenz.LZMADecoder cannot access
> its
> > superclass org.apache.commons.compress.archivers.sevenz.CoderBase
>
> I don't know, but the warning has been there for a long time. It is a
> false positive.
>
> > Nit:
>
> > [INFO] --- maven-compiler-plugin:3.7.0:compile (default-compile) @
> > commons-compress ---
> > [INFO] Changes detected - recompiling the module!
> > [INFO] Compiling 206 source files to
> > C:\temp\rc\commons-compress-1.18-src\target\classes
> > [INFO]
> >
> /C:/temp/rc/commons-compress-1.18-src/src/main/java/org/apache/commons/compress/utils/Sets.java:
> >
> C:\temp\rc\commons-compress-1.18-src\src\main\java\org\apache\commons\compress\utils\Sets.java
> > uses unchecked or unsafe operations.
> > [INFO]
> >
> /C:/temp/rc/commons-compress-1.18-src/src/main/java/org/apache/commons/compress/utils/Sets.java:
> > Recompile with -Xlint:unchecked for details.
>
> I've overlooked that and must have done for quite some time. The class
> hasn't been touched for more than a year.
>
> > Too bad we get multiple instances of ProjectBuildingException:
>
> > [INFO] Generating "Dependencies" report  ---
> > maven-project-info-reports-plugin:3.0.0:dependencies
> > [WARNING] Unable to create Maven project from repository.
> > org.apache.maven.project.ProjectBuildingException: Some problems were
> > encountered while processing the POMs:
> > [ERROR] Unknown packaging: bundle @ line 6, column 16
>
> Yes, I've seen that, but have no idea how to fix that. It seems the
> dependency plugin doesn't know "bundle" packaging but some of the (test)
> dependencies use it. No idea how we could fix that.
>
> > Using:
>
> > Java version: 10.0.2, vendor: Oracle Corporation, runtime: C:\Program
> > Files\Java\jdk-10.0.2
>
> > Yields:
>
> > [INFO] -------------------------------------------------------
> > [INFO]  T E S T S
> > [INFO] -------------------------------------------------------
> > [WARNING] Corrupted STDOUT by directly writing to native stream in forked
> > JVM 1. See FAQ web page and the dump file
> >
> C:\temp\rc\commons-compress-1.18-src\target\surefire-reports\2018-08-13T12-22-16_818-jvmRun1.dumpstream
>
> This happens in Jenkins as well and I don't know how to fix it. I think
> I once looked into it and it is a known Surefire issue.
>
> Stefan
>
Reply | Threaded
Open this post in threaded view
|

Re: [VOTE] Release Compress 1.18 based on RC1

Stefan Bodewig
In reply to this post by Rob Tompkins
On 2018-08-14, Rob Tompkins wrote:

> Must fix during artifact promotion:

> (1) Signature files contain more than the correct signatures (note the contents below):

This is the well known default format of GNU textutil's sha256sum.

Is this really a problem? I'm not aware of any policy that requires a
specific format.

> Nits:
> (1) .asc files have .md5s and .sha1s up in nexus (curiousity, but no worries).

Nexus adds them and there is no way to prevent them (unless I was
willing to use mvn deploy and manually remove the files before closing
the staging repo rather than using a bundle upload which auto-closes the
repo - which I'm not).

Stefan

---------------------------------------------------------------------
To unsubscribe, e-mail: [hidden email]
For additional commands, e-mail: [hidden email]

Reply | Threaded
Open this post in threaded view
|

Re: [VOTE] Release Compress 1.18 based on RC1

Rob Tompkins


> On Aug 14, 2018, at 12:26 AM, Stefan Bodewig <[hidden email]> wrote:
>
>> On 2018-08-14, Rob Tompkins wrote:
>>
>> Must fix during artifact promotion:
>
>> (1) Signature files contain more than the correct signatures (note the contents below):
>
> This is the well known default format of GNU textutil's sha256sum.
>
> Is this really a problem? I'm not aware of any policy that requires a
> specific format.
>

Oh. Pardon, I didn’t know that. Disregard my message on that being a must fix then.

-Rob

>> Nits:
>> (1) .asc files have .md5s and .sha1s up in nexus (curiousity, but no worries).
>
> Nexus adds them and there is no way to prevent them (unless I was
> willing to use mvn deploy and manually remove the files before closing
> the staging repo rather than using a bundle upload which auto-closes the
> repo - which I'm not).
>
> Stefan
>
> ---------------------------------------------------------------------
> To unsubscribe, e-mail: [hidden email]
> For additional commands, e-mail: [hidden email]
>

---------------------------------------------------------------------
To unsubscribe, e-mail: [hidden email]
For additional commands, e-mail: [hidden email]

Reply | Threaded
Open this post in threaded view
|

Re: [VOTE] Release Compress 1.18 based on RC1

Bruno P. Kinoshita-3
In reply to this post by Stefan Bodewig
[ X ] +1 Release these artifacts


Building fine on


Apache Maven 3.5.2 (138edd61fd100ec658bfa2d307c43b76940a5d7d; 2017-10-18T20:58:13+13:00)
Maven home: /opt/apache-maven-3.5.2
Java version: 1.8.0_181, vendor: Oracle Corporation
Java home: /usr/lib/jvm/java-8-openjdk-amd64/jre
Default locale: en_NZ, platform encoding: UTF-8
OS name: "linux", version: "4.4.0-131-generic", arch: "amd64", family: "unix"



Reports look OK (branch coverage appears to have decreased a bit but not a blocker IMO).


Checked signatures of archives in maven staging repo, and dist area, and keys matched.

Had a look inside some files in the dist area and found no issues.


Thanks!
Bruno


________________________________
From: Stefan Bodewig <[hidden email]>
To: Commons Developers List <[hidden email]>
Sent: Monday, 13 August 2018 7:44 PM
Subject: [VOTE] Release Compress 1.18 based on RC1



Hi all,


I would like to release Compress 1.18.


Compress 1.18 RC1 is available for review here:

    https://dist.apache.org/repos/dist/dev/commons/compress/ (svn revision 28684)


The tag is here:

    tag 1.18-RC1 on commit b95d5cde

    https://git-wip-us.apache.org/repos/asf?p=commons-compress.git;a=commit;h=b95d5cde4c68640f886e3c6802384fae47408a37


Maven artifacts are here:

    https://repository.apache.org/content/repositories/orgapachecommons-1367/org/apache/commons/commons-compress/1.18/


These are the Maven artifacts and their SHA256 hashes


5f2df1e467825e4cac5996d44890c4201c000b43c0b23cffc0782d28a0beb9b0  commons-compress-1.18.jar

23b382156431d6350745c571e533fabe28aebe8da1de6e039e8e480bb9764dfc  commons-compress-1.18-javadoc.jar

c8e6896eb3d3880ffc21bb93d563b7cc0d3e2152c8181f261a748502290a5947  commons-compress-1.18-sources.jar

630a8c16d58d2d7475c82a98b032390831d22589bccd0f9086e95e85742a41b3  commons-compress-1.18-tests.jar

ea06230ae8f1ef954da571d3bb13c2324fee703d7cfee2699a76d3793b531cec  commons-compress-1.18-test-sources.jar

672c5fe92bd3eab43e8d53338cad5ca073b6529de4eb2b38859a3eaa6c9e8119  commons-compress-1.18.pom


I have tested this with JDK 8 using Maven 3.5.4.


Details of changes since 1.17 are in the release notes:

    https://dist.apache.org/repos/dist/dev/commons/compress/RELEASE-NOTES.txt

    https://stefan.samaflost.de/staging/commons-compress-1.18/changes-report.html


Site:

    https://stefan.samaflost.de/staging/commons-compress-1.18/


    as usual this is not the site I'm going to publish after the

    release, I'll re-create the site when the release date is

    clear. The download link and 1.18 javadoc link won't work right

    now.


japicmp Report (compared to 1.17):

    https://stefan.samaflost.de/staging/commons-compress-1.18/japicmp.html


RAT Report:

    https://stefan.samaflost.de/staging/commons-compress-1.18/rat-report.html


KEYS:

  https://www.apache.org/dist/commons/KEYS


Please review the release candidate and vote.

This vote will close no sooner that 72 hours from now,

i.e. sometime after 08:00 UTC 16-August 2018


  [ ] +1 Release these artifacts

  [ ] +0 OK, but...

  [ ] -0 OK, but really should fix...

  [ ] -1 I oppose this release because...


Thanks!


        Stefan


---------------------------------------------------------------------

To unsubscribe, e-mail: [hidden email]

For additional commands, e-mail: [hidden email]

---------------------------------------------------------------------
To unsubscribe, e-mail: [hidden email]
For additional commands, e-mail: [hidden email]

Reply | Threaded
Open this post in threaded view
|

Re: [VOTE] Release Compress 1.18 based on RC1

Stefan Bodewig
In reply to this post by Rob Tompkins
On 2018-08-14, Rob Tompkins wrote:

>> On Aug 14, 2018, at 12:26 AM, Stefan Bodewig <[hidden email]> wrote:

>>> On 2018-08-14, Rob Tompkins wrote:

>>> Must fix during artifact promotion:

>>> (1) Signature files contain more than the correct signatures (note the contents below):

>> This is the well known default format of GNU textutil's sha256sum.

>> Is this really a problem? I'm not aware of any policy that requires a
>> specific format.


> Oh. Pardon, I didn’t know that. Disregard my message on that being a must fix then.

Thank you for bringing it up. I may have missed a poiicy here or there.

Stefan

---------------------------------------------------------------------
To unsubscribe, e-mail: [hidden email]
For additional commands, e-mail: [hidden email]

Reply | Threaded
Open this post in threaded view
|

[RESULT] Release Compress 1.18 based on RC1

Stefan Bodewig
In reply to this post by Stefan Bodewig
Hi all

with +1s by

Gary Gregory
Rob Tompkins
Bruno P. Kinoshita

my own implicit one and no other votes, the vote has passed.

I'll proceed with publishing the artifacts and announce the release
after the mirrors had time to catch up.

Many thanks to all who vetted the release

     Stefan

---------------------------------------------------------------------
To unsubscribe, e-mail: [hidden email]
For additional commands, e-mail: [hidden email]