[jira] Created: (VFS-197) Maven2 Build Fails

classic Classic list List threaded Threaded
5 messages Options
Reply | Threaded
Open this post in threaded view
|

[jira] Created: (VFS-197) Maven2 Build Fails

JIRA jira@apache.org
Maven2 Build Fails
------------------

                 Key: VFS-197
                 URL: https://issues.apache.org/jira/browse/VFS-197
             Project: Commons VFS
          Issue Type: Bug
    Affects Versions: 1.1
            Reporter: James Carman
             Fix For: 1.1


On my machine, the maven2 build fails with the following exception:

-------------------------------------------------------------------------------
Test set: org.apache.commons.vfs.test.FileSystemManagerFactoryTestCase
-------------------------------------------------------------------------------
Tests run: 1, Failures: 1, Errors: 0, Skipped: 0, Time elapsed: 0.056 sec <<< FAILURE!
testDefaultInstance(org.apache.commons.vfs.test.FileSystemManagerFactoryTestCase)  Time elapsed: 0.018 sec  <<< FAILURE!
junit.framework.AssertionFailedError: Test file "C:\Users\jcarman\IdeaProjects\commons-vfs-clean\core\target\test-classes\test-data\test.jar" does not exist.
        at junit.framework.Assert.fail(Assert.java:47)
        at junit.framework.Assert.assertTrue(Assert.java:20)
        at org.apache.commons.AbstractVfsTestCase.getTestResource(AbstractVfsTestCase.java:85)
        at org.apache.commons.AbstractVfsTestCase.getTestResource(AbstractVfsTestCase.java:71)
        at org.apache.commons.vfs.test.FileSystemManagerFactoryTestCase.testDefaultInstance(FileSystemManagerFactoryTestCase.java:45)
        at org.apache.commons.vfs.test.FileSystemManagerFactoryTestCase.testDefaultInstance(FileSystemManagerFactoryTestCase.java:45)
        at sun.reflect.NativeMethodAccessorImpl.invoke0(Native Method)
        at sun.reflect.NativeMethodAccessorImpl.invoke(NativeMethodAccessorImpl.java:39)
        at sun.reflect.DelegatingMethodAccessorImpl.invoke(DelegatingMethodAccessorImpl.java:25)
        at java.lang.reflect.Method.invoke(Method.java:585)
        at junit.framework.TestCase.runTest(TestCase.java:154)
        at junit.framework.TestCase.runBare(TestCase.java:127)
        at junit.framework.TestResult$1.protect(TestResult.java:106)
        at junit.framework.TestResult.runProtected(TestResult.java:124)
        at junit.framework.TestResult.run(TestResult.java:109)
        at junit.framework.TestCase.run(TestCase.java:118)
        at junit.framework.TestSuite.runTest(TestSuite.java:208)
        at junit.framework.TestSuite.run(TestSuite.java:203)
        at sun.reflect.NativeMethodAccessorImpl.invoke0(Native Method)
        at sun.reflect.NativeMethodAccessorImpl.invoke(NativeMethodAccessorImpl.java:39)
        at sun.reflect.DelegatingMethodAccessorImpl.invoke(DelegatingMethodAccessorImpl.java:25)
        at java.lang.reflect.Method.invoke(Method.java:585)
        at org.apache.maven.surefire.junit.JUnitTestSet.execute(JUnitTestSet.java:213)
        at org.apache.maven.surefire.suite.AbstractDirectoryTestSuite.executeTestSet(AbstractDirectoryTestSuite.java:138)
        at org.apache.maven.surefire.suite.AbstractDirectoryTestSuite.execute(AbstractDirectoryTestSuite.java:125)
        at org.apache.maven.surefire.Surefire.run(Surefire.java:132)
        at sun.reflect.NativeMethodAccessorImpl.invoke0(Native Method)
        at sun.reflect.NativeMethodAccessorImpl.invoke(NativeMethodAccessorImpl.java:39)
        at sun.reflect.DelegatingMethodAccessorImpl.invoke(DelegatingMethodAccessorImpl.java:25)
        at java.lang.reflect.Method.invoke(Method.java:585)
        at org.apache.maven.surefire.booter.SurefireBooter.runSuitesInProcess(SurefireBooter.java:290)
        at org.apache.maven.surefire.booter.SurefireBooter.main(SurefireBooter.java:818)

The problem is that the maven build isn't copying the test data over into the target folder.  I can fix this, but it will mean moving the test data around a bit by putting it in the src/main/resources (the standard place for testing resources for m2).  I'll attach a patch illustrating my changes.

--
This message is automatically generated by JIRA.
-
You can reply to this email to add a comment to the issue online.

Reply | Threaded
Open this post in threaded view
|

[jira] Commented: (VFS-197) Maven2 Build Fails

JIRA jira@apache.org

    [ https://issues.apache.org/jira/browse/VFS-197?page=com.atlassian.jira.plugin.system.issuetabpanels:comment-tabpanel&focusedCommentId=12599576#action_12599576 ]

James Carman commented on VFS-197:
----------------------------------

Alternatively, we can add a test resources section to VFS' pom.xml file saying that it should copy all non-java files in its src/test/java directory as test resources.  Would you like me to attach a patch?

> Maven2 Build Fails
> ------------------
>
>                 Key: VFS-197
>                 URL: https://issues.apache.org/jira/browse/VFS-197
>             Project: Commons VFS
>          Issue Type: Bug
>    Affects Versions: 1.1
>            Reporter: James Carman
>             Fix For: 1.1
>
>   Original Estimate: 1h
>  Remaining Estimate: 1h
>
> On my machine, the maven2 build fails with the following exception:
> -------------------------------------------------------------------------------
> Test set: org.apache.commons.vfs.test.FileSystemManagerFactoryTestCase
> -------------------------------------------------------------------------------
> Tests run: 1, Failures: 1, Errors: 0, Skipped: 0, Time elapsed: 0.056 sec <<< FAILURE!
> testDefaultInstance(org.apache.commons.vfs.test.FileSystemManagerFactoryTestCase)  Time elapsed: 0.018 sec  <<< FAILURE!
> junit.framework.AssertionFailedError: Test file "C:\Users\jcarman\IdeaProjects\commons-vfs-clean\core\target\test-classes\test-data\test.jar" does not exist.
> at junit.framework.Assert.fail(Assert.java:47)
> at junit.framework.Assert.assertTrue(Assert.java:20)
> at org.apache.commons.AbstractVfsTestCase.getTestResource(AbstractVfsTestCase.java:85)
> at org.apache.commons.AbstractVfsTestCase.getTestResource(AbstractVfsTestCase.java:71)
> at org.apache.commons.vfs.test.FileSystemManagerFactoryTestCase.testDefaultInstance(FileSystemManagerFactoryTestCase.java:45)
> at org.apache.commons.vfs.test.FileSystemManagerFactoryTestCase.testDefaultInstance(FileSystemManagerFactoryTestCase.java:45)
> at sun.reflect.NativeMethodAccessorImpl.invoke0(Native Method)
> at sun.reflect.NativeMethodAccessorImpl.invoke(NativeMethodAccessorImpl.java:39)
> at sun.reflect.DelegatingMethodAccessorImpl.invoke(DelegatingMethodAccessorImpl.java:25)
> at java.lang.reflect.Method.invoke(Method.java:585)
> at junit.framework.TestCase.runTest(TestCase.java:154)
> at junit.framework.TestCase.runBare(TestCase.java:127)
> at junit.framework.TestResult$1.protect(TestResult.java:106)
> at junit.framework.TestResult.runProtected(TestResult.java:124)
> at junit.framework.TestResult.run(TestResult.java:109)
> at junit.framework.TestCase.run(TestCase.java:118)
> at junit.framework.TestSuite.runTest(TestSuite.java:208)
> at junit.framework.TestSuite.run(TestSuite.java:203)
> at sun.reflect.NativeMethodAccessorImpl.invoke0(Native Method)
> at sun.reflect.NativeMethodAccessorImpl.invoke(NativeMethodAccessorImpl.java:39)
> at sun.reflect.DelegatingMethodAccessorImpl.invoke(DelegatingMethodAccessorImpl.java:25)
> at java.lang.reflect.Method.invoke(Method.java:585)
> at org.apache.maven.surefire.junit.JUnitTestSet.execute(JUnitTestSet.java:213)
> at org.apache.maven.surefire.suite.AbstractDirectoryTestSuite.executeTestSet(AbstractDirectoryTestSuite.java:138)
> at org.apache.maven.surefire.suite.AbstractDirectoryTestSuite.execute(AbstractDirectoryTestSuite.java:125)
> at org.apache.maven.surefire.Surefire.run(Surefire.java:132)
> at sun.reflect.NativeMethodAccessorImpl.invoke0(Native Method)
> at sun.reflect.NativeMethodAccessorImpl.invoke(NativeMethodAccessorImpl.java:39)
> at sun.reflect.DelegatingMethodAccessorImpl.invoke(DelegatingMethodAccessorImpl.java:25)
> at java.lang.reflect.Method.invoke(Method.java:585)
> at org.apache.maven.surefire.booter.SurefireBooter.runSuitesInProcess(SurefireBooter.java:290)
> at org.apache.maven.surefire.booter.SurefireBooter.main(SurefireBooter.java:818)
> The problem is that the maven build isn't copying the test data over into the target folder.  I can fix this, but it will mean moving the test data around a bit by putting it in the src/main/resources (the standard place for testing resources for m2).  I'll attach a patch illustrating my changes.

--
This message is automatically generated by JIRA.
-
You can reply to this email to add a comment to the issue online.

Reply | Threaded
Open this post in threaded view
|

[jira] Commented: (VFS-197) Maven2 Build Fails

JIRA jira@apache.org
In reply to this post by JIRA jira@apache.org

    [ https://issues.apache.org/jira/browse/VFS-197?page=com.atlassian.jira.plugin.system.issuetabpanels:comment-tabpanel&focusedCommentId=12599581#action_12599581 ]

Mario Ivankovits commented on VFS-197:
--------------------------------------

If you know how to fix maven to copy the test resources around I am fine if you are commit that thing then :-)

Just keep in mind that the ancient ant script is not broken afterwards (just in case you move directories around)

Thanks!

> Maven2 Build Fails
> ------------------
>
>                 Key: VFS-197
>                 URL: https://issues.apache.org/jira/browse/VFS-197
>             Project: Commons VFS
>          Issue Type: Bug
>    Affects Versions: 1.1
>            Reporter: James Carman
>             Fix For: 1.1
>
>   Original Estimate: 1h
>  Remaining Estimate: 1h
>
> On my machine, the maven2 build fails with the following exception:
> -------------------------------------------------------------------------------
> Test set: org.apache.commons.vfs.test.FileSystemManagerFactoryTestCase
> -------------------------------------------------------------------------------
> Tests run: 1, Failures: 1, Errors: 0, Skipped: 0, Time elapsed: 0.056 sec <<< FAILURE!
> testDefaultInstance(org.apache.commons.vfs.test.FileSystemManagerFactoryTestCase)  Time elapsed: 0.018 sec  <<< FAILURE!
> junit.framework.AssertionFailedError: Test file "C:\Users\jcarman\IdeaProjects\commons-vfs-clean\core\target\test-classes\test-data\test.jar" does not exist.
> at junit.framework.Assert.fail(Assert.java:47)
> at junit.framework.Assert.assertTrue(Assert.java:20)
> at org.apache.commons.AbstractVfsTestCase.getTestResource(AbstractVfsTestCase.java:85)
> at org.apache.commons.AbstractVfsTestCase.getTestResource(AbstractVfsTestCase.java:71)
> at org.apache.commons.vfs.test.FileSystemManagerFactoryTestCase.testDefaultInstance(FileSystemManagerFactoryTestCase.java:45)
> at org.apache.commons.vfs.test.FileSystemManagerFactoryTestCase.testDefaultInstance(FileSystemManagerFactoryTestCase.java:45)
> at sun.reflect.NativeMethodAccessorImpl.invoke0(Native Method)
> at sun.reflect.NativeMethodAccessorImpl.invoke(NativeMethodAccessorImpl.java:39)
> at sun.reflect.DelegatingMethodAccessorImpl.invoke(DelegatingMethodAccessorImpl.java:25)
> at java.lang.reflect.Method.invoke(Method.java:585)
> at junit.framework.TestCase.runTest(TestCase.java:154)
> at junit.framework.TestCase.runBare(TestCase.java:127)
> at junit.framework.TestResult$1.protect(TestResult.java:106)
> at junit.framework.TestResult.runProtected(TestResult.java:124)
> at junit.framework.TestResult.run(TestResult.java:109)
> at junit.framework.TestCase.run(TestCase.java:118)
> at junit.framework.TestSuite.runTest(TestSuite.java:208)
> at junit.framework.TestSuite.run(TestSuite.java:203)
> at sun.reflect.NativeMethodAccessorImpl.invoke0(Native Method)
> at sun.reflect.NativeMethodAccessorImpl.invoke(NativeMethodAccessorImpl.java:39)
> at sun.reflect.DelegatingMethodAccessorImpl.invoke(DelegatingMethodAccessorImpl.java:25)
> at java.lang.reflect.Method.invoke(Method.java:585)
> at org.apache.maven.surefire.junit.JUnitTestSet.execute(JUnitTestSet.java:213)
> at org.apache.maven.surefire.suite.AbstractDirectoryTestSuite.executeTestSet(AbstractDirectoryTestSuite.java:138)
> at org.apache.maven.surefire.suite.AbstractDirectoryTestSuite.execute(AbstractDirectoryTestSuite.java:125)
> at org.apache.maven.surefire.Surefire.run(Surefire.java:132)
> at sun.reflect.NativeMethodAccessorImpl.invoke0(Native Method)
> at sun.reflect.NativeMethodAccessorImpl.invoke(NativeMethodAccessorImpl.java:39)
> at sun.reflect.DelegatingMethodAccessorImpl.invoke(DelegatingMethodAccessorImpl.java:25)
> at java.lang.reflect.Method.invoke(Method.java:585)
> at org.apache.maven.surefire.booter.SurefireBooter.runSuitesInProcess(SurefireBooter.java:290)
> at org.apache.maven.surefire.booter.SurefireBooter.main(SurefireBooter.java:818)
> The problem is that the maven build isn't copying the test data over into the target folder.  I can fix this, but it will mean moving the test data around a bit by putting it in the src/main/resources (the standard place for testing resources for m2).  I'll attach a patch illustrating my changes.

--
This message is automatically generated by JIRA.
-
You can reply to this email to add a comment to the issue online.

Reply | Threaded
Open this post in threaded view
|

[jira] Closed: (VFS-197) Maven2 Build Fails

JIRA jira@apache.org
In reply to this post by JIRA jira@apache.org

     [ https://issues.apache.org/jira/browse/VFS-197?page=com.atlassian.jira.plugin.system.issuetabpanels:all-tabpanel ]

James Carman closed VFS-197.
----------------------------


> Maven2 Build Fails
> ------------------
>
>                 Key: VFS-197
>                 URL: https://issues.apache.org/jira/browse/VFS-197
>             Project: Commons VFS
>          Issue Type: Bug
>    Affects Versions: 1.1
>            Reporter: James Carman
>            Assignee: James Carman
>             Fix For: 1.1, 2.0
>
>   Original Estimate: 1h
>  Remaining Estimate: 1h
>
> On my machine, the maven2 build fails with the following exception:
> -------------------------------------------------------------------------------
> Test set: org.apache.commons.vfs.test.FileSystemManagerFactoryTestCase
> -------------------------------------------------------------------------------
> Tests run: 1, Failures: 1, Errors: 0, Skipped: 0, Time elapsed: 0.056 sec <<< FAILURE!
> testDefaultInstance(org.apache.commons.vfs.test.FileSystemManagerFactoryTestCase)  Time elapsed: 0.018 sec  <<< FAILURE!
> junit.framework.AssertionFailedError: Test file "C:\Users\jcarman\IdeaProjects\commons-vfs-clean\core\target\test-classes\test-data\test.jar" does not exist.
> at junit.framework.Assert.fail(Assert.java:47)
> at junit.framework.Assert.assertTrue(Assert.java:20)
> at org.apache.commons.AbstractVfsTestCase.getTestResource(AbstractVfsTestCase.java:85)
> at org.apache.commons.AbstractVfsTestCase.getTestResource(AbstractVfsTestCase.java:71)
> at org.apache.commons.vfs.test.FileSystemManagerFactoryTestCase.testDefaultInstance(FileSystemManagerFactoryTestCase.java:45)
> at org.apache.commons.vfs.test.FileSystemManagerFactoryTestCase.testDefaultInstance(FileSystemManagerFactoryTestCase.java:45)
> at sun.reflect.NativeMethodAccessorImpl.invoke0(Native Method)
> at sun.reflect.NativeMethodAccessorImpl.invoke(NativeMethodAccessorImpl.java:39)
> at sun.reflect.DelegatingMethodAccessorImpl.invoke(DelegatingMethodAccessorImpl.java:25)
> at java.lang.reflect.Method.invoke(Method.java:585)
> at junit.framework.TestCase.runTest(TestCase.java:154)
> at junit.framework.TestCase.runBare(TestCase.java:127)
> at junit.framework.TestResult$1.protect(TestResult.java:106)
> at junit.framework.TestResult.runProtected(TestResult.java:124)
> at junit.framework.TestResult.run(TestResult.java:109)
> at junit.framework.TestCase.run(TestCase.java:118)
> at junit.framework.TestSuite.runTest(TestSuite.java:208)
> at junit.framework.TestSuite.run(TestSuite.java:203)
> at sun.reflect.NativeMethodAccessorImpl.invoke0(Native Method)
> at sun.reflect.NativeMethodAccessorImpl.invoke(NativeMethodAccessorImpl.java:39)
> at sun.reflect.DelegatingMethodAccessorImpl.invoke(DelegatingMethodAccessorImpl.java:25)
> at java.lang.reflect.Method.invoke(Method.java:585)
> at org.apache.maven.surefire.junit.JUnitTestSet.execute(JUnitTestSet.java:213)
> at org.apache.maven.surefire.suite.AbstractDirectoryTestSuite.executeTestSet(AbstractDirectoryTestSuite.java:138)
> at org.apache.maven.surefire.suite.AbstractDirectoryTestSuite.execute(AbstractDirectoryTestSuite.java:125)
> at org.apache.maven.surefire.Surefire.run(Surefire.java:132)
> at sun.reflect.NativeMethodAccessorImpl.invoke0(Native Method)
> at sun.reflect.NativeMethodAccessorImpl.invoke(NativeMethodAccessorImpl.java:39)
> at sun.reflect.DelegatingMethodAccessorImpl.invoke(DelegatingMethodAccessorImpl.java:25)
> at java.lang.reflect.Method.invoke(Method.java:585)
> at org.apache.maven.surefire.booter.SurefireBooter.runSuitesInProcess(SurefireBooter.java:290)
> at org.apache.maven.surefire.booter.SurefireBooter.main(SurefireBooter.java:818)
> The problem is that the maven build isn't copying the test data over into the target folder.  I can fix this, but it will mean moving the test data around a bit by putting it in the src/main/resources (the standard place for testing resources for m2).  I'll attach a patch illustrating my changes.

--
This message is automatically generated by JIRA.
-
You can reply to this email to add a comment to the issue online.

Reply | Threaded
Open this post in threaded view
|

[jira] Resolved: (VFS-197) Maven2 Build Fails

JIRA jira@apache.org
In reply to this post by JIRA jira@apache.org

     [ https://issues.apache.org/jira/browse/VFS-197?page=com.atlassian.jira.plugin.system.issuetabpanels:all-tabpanel ]

James Carman resolved VFS-197.
------------------------------

       Resolution: Fixed
    Fix Version/s: 2.0

I applied this change to both the version 1 branch and the main trunk.  

> Maven2 Build Fails
> ------------------
>
>                 Key: VFS-197
>                 URL: https://issues.apache.org/jira/browse/VFS-197
>             Project: Commons VFS
>          Issue Type: Bug
>    Affects Versions: 1.1
>            Reporter: James Carman
>            Assignee: James Carman
>             Fix For: 1.1, 2.0
>
>   Original Estimate: 1h
>  Remaining Estimate: 1h
>
> On my machine, the maven2 build fails with the following exception:
> -------------------------------------------------------------------------------
> Test set: org.apache.commons.vfs.test.FileSystemManagerFactoryTestCase
> -------------------------------------------------------------------------------
> Tests run: 1, Failures: 1, Errors: 0, Skipped: 0, Time elapsed: 0.056 sec <<< FAILURE!
> testDefaultInstance(org.apache.commons.vfs.test.FileSystemManagerFactoryTestCase)  Time elapsed: 0.018 sec  <<< FAILURE!
> junit.framework.AssertionFailedError: Test file "C:\Users\jcarman\IdeaProjects\commons-vfs-clean\core\target\test-classes\test-data\test.jar" does not exist.
> at junit.framework.Assert.fail(Assert.java:47)
> at junit.framework.Assert.assertTrue(Assert.java:20)
> at org.apache.commons.AbstractVfsTestCase.getTestResource(AbstractVfsTestCase.java:85)
> at org.apache.commons.AbstractVfsTestCase.getTestResource(AbstractVfsTestCase.java:71)
> at org.apache.commons.vfs.test.FileSystemManagerFactoryTestCase.testDefaultInstance(FileSystemManagerFactoryTestCase.java:45)
> at org.apache.commons.vfs.test.FileSystemManagerFactoryTestCase.testDefaultInstance(FileSystemManagerFactoryTestCase.java:45)
> at sun.reflect.NativeMethodAccessorImpl.invoke0(Native Method)
> at sun.reflect.NativeMethodAccessorImpl.invoke(NativeMethodAccessorImpl.java:39)
> at sun.reflect.DelegatingMethodAccessorImpl.invoke(DelegatingMethodAccessorImpl.java:25)
> at java.lang.reflect.Method.invoke(Method.java:585)
> at junit.framework.TestCase.runTest(TestCase.java:154)
> at junit.framework.TestCase.runBare(TestCase.java:127)
> at junit.framework.TestResult$1.protect(TestResult.java:106)
> at junit.framework.TestResult.runProtected(TestResult.java:124)
> at junit.framework.TestResult.run(TestResult.java:109)
> at junit.framework.TestCase.run(TestCase.java:118)
> at junit.framework.TestSuite.runTest(TestSuite.java:208)
> at junit.framework.TestSuite.run(TestSuite.java:203)
> at sun.reflect.NativeMethodAccessorImpl.invoke0(Native Method)
> at sun.reflect.NativeMethodAccessorImpl.invoke(NativeMethodAccessorImpl.java:39)
> at sun.reflect.DelegatingMethodAccessorImpl.invoke(DelegatingMethodAccessorImpl.java:25)
> at java.lang.reflect.Method.invoke(Method.java:585)
> at org.apache.maven.surefire.junit.JUnitTestSet.execute(JUnitTestSet.java:213)
> at org.apache.maven.surefire.suite.AbstractDirectoryTestSuite.executeTestSet(AbstractDirectoryTestSuite.java:138)
> at org.apache.maven.surefire.suite.AbstractDirectoryTestSuite.execute(AbstractDirectoryTestSuite.java:125)
> at org.apache.maven.surefire.Surefire.run(Surefire.java:132)
> at sun.reflect.NativeMethodAccessorImpl.invoke0(Native Method)
> at sun.reflect.NativeMethodAccessorImpl.invoke(NativeMethodAccessorImpl.java:39)
> at sun.reflect.DelegatingMethodAccessorImpl.invoke(DelegatingMethodAccessorImpl.java:25)
> at java.lang.reflect.Method.invoke(Method.java:585)
> at org.apache.maven.surefire.booter.SurefireBooter.runSuitesInProcess(SurefireBooter.java:290)
> at org.apache.maven.surefire.booter.SurefireBooter.main(SurefireBooter.java:818)
> The problem is that the maven build isn't copying the test data over into the target folder.  I can fix this, but it will mean moving the test data around a bit by putting it in the src/main/resources (the standard place for testing resources for m2).  I'll attach a patch illustrating my changes.

--
This message is automatically generated by JIRA.
-
You can reply to this email to add a comment to the issue online.