Apache Continuum
Apache Continuum
Unregistered User
Groups: Anyone
Posts in Apache Commons
1234 ... 23
Show   Total: 457 items
Date Subject Count Location
[continuum] BUILD FAILURE: Apache Commons Net - Apache Commons (Maven 3 Build Definition (Java 1.5)) 0 replies Commons - Dev
[continuum] BUILD FAILURE: Apache Commons Parent - Apache Commons (CP cannot use -Prelease; uses Java 1.5) 0 replies Commons - Dev
[continuum] BUILD FAILURE: Apache Commons Validator - Apache Commons (Group (shared) Maven 3 Build Definition (Java 1.6)) 6 replies Commons - Dev
[continuum] BUILD FAILURE: Apache Commons Validator - Apache Commons (Test if can build / test with Java 1.5) 0 replies Commons - Dev
[continuum] BUILD FAILURE: Apache Commons Compress - Apache Commons (Group (shared) Maven 3 Build Definition (Java 1.6)) 0 replies Commons - Dev
[continuum] BUILD FAILURE: Apache Commons JCS - Apache Commons (Group (shared) Maven 3 Build Definition (Java 1.6)) 0 replies Commons - Dev
[continuum] BUILD FAILURE: Apache Commons Net - Apache Commons (Maven 3 Build Definition (Java 1.5)) 0 replies Commons - Dev
[continuum] BUILD FAILURE: Apache Commons Net - Apache Commons (Maven 3 Build Definition (Java 1.5)) 0 replies Commons - Dev
[continuum] BUILD FAILURE: Apache Commons Validator - Apache Commons (Test if can build / test with Java 1.5) 0 replies Commons - Dev
[continuum] BUILD FAILURE: Apache Commons Validator - Apache Commons (Test if can build / test with Java 1.4) 2 replies Commons - Dev
[continuum] BUILD FAILURE: Apache Commons Compress - Apache Commons (Group (shared) Maven 3 Build Definition (Java 1.6)) 0 replies Commons - Dev
[continuum] BUILD FAILURE: Apache Commons Collections - Apache Commons (Group (shared) Maven 3 Build Definition (Java 1.6)) 0 replies Commons - Dev
[continuum] BUILD FAILURE: Apache Commons Collections - Apache Commons (Group (shared) Maven 3 Build Definition (Java 1.6)) 0 replies Commons - Dev
[continuum] BUILD FAILURE: Apache Commons Compress - Apache Commons (Group (shared) Maven 3 Build Definition (Java 1.6)) 0 replies Commons - Dev
[continuum] BUILD FAILURE: Apache Commons Compress - Apache Commons (Group (shared) Maven 3 Build Definition (Java 1.6)) 0 replies Commons - Dev
[continuum] BUILD FAILURE: Apache Commons BCEL - Apache Commons (Group (shared) Maven 3 Build Definition (Java 1.6)) 0 replies Commons - Dev
[continuum] BUILD FAILURE: Apache Commons VFS - Apache Commons (Group (shared) Maven 3 Build Definition (Java 1.6)) 0 replies Commons - Dev
[continuum] BUILD FAILURE: Apache Commons JCS - Apache Commons (Group (shared) Maven 3 Build Definition (Java 1.6)) 0 replies Commons - Dev
[continuum] BUILD FAILURE: Apache Commons VFS - Apache Commons (Group (shared) Maven 3 Build Definition (Java 1.6)) 0 replies Commons - Dev
[continuum] BUILD FAILURE: Apache Commons JCS - Apache Commons (Group (shared) Maven 3 Build Definition (Java 1.6)) 0 replies Commons - Dev
1234 ... 23